[sr-dev] Build failed in Jenkins: kamailio51-nightly-binaries » amd64,buster,slave #84

classic Classic list List threaded Threaded
2 messages Options
Reply | Threaded
Open this post in threaded view
|

[sr-dev] Build failed in Jenkins: kamailio51-nightly-binaries » amd64,buster,slave #84

jenkins-2
See <https://kamailio.sipwise.com/job/kamailio51-nightly-binaries/architecture=amd64,distribution=buster,label=slave/84/display/redirect>

------------------------------------------
[...truncated 596.71 KB...]
CC (gcc) [kamailio] core/str.o
CC (gcc) [kamailio] core/ut.o
CC (gcc) [kamailio] core/forward.o
CC (gcc) [kamailio] core/pvapi.o
CC (gcc) [kamailio] core/dst_blacklist.o
CC (gcc) [kamailio] core/bit_count.o
CC (gcc) [kamailio] core/atomic_ops.o
CC (gcc) [kamailio] core/data_lump.o
CC (gcc) [kamailio] core/raw_listener.o
CC (gcc) [kamailio] core/action.o
CC (gcc) [kamailio] core/dns_cache.o
CC (gcc) [kamailio] core/timer.o
CC (gcc) [kamailio] core/endianness.o
CC (gcc) [kamailio] core/switch.o
CC (gcc) [kamailio] core/select_core.o
core/select_core.c: In function 'select_uri_hostport':
core/select_core.c:854:4: warning: 'strncpy' output truncated before terminating nul copying 5 bytes from a string of the same length [-Wstringop-truncation]
    strncpy(p+select_uri_p->host.len, ":5061", 5);
    ^~~~~~~~~~~~~~~~~~~~~~~~~~~~~~~~~~~~~~~~~~~~~
core/select_core.c:859:4: warning: 'strncpy' output truncated before terminating nul copying 5 bytes from a string of the same length [-Wstringop-truncation]
    strncpy(p+select_uri_p->host.len, ":5060", 5);
    ^~~~~~~~~~~~~~~~~~~~~~~~~~~~~~~~~~~~~~~~~~~~~
CC (gcc) [kamailio] core/resolve.o
CC (gcc) [kamailio] core/daemonize.o
CC (gcc) [kamailio] core/kemi.o
CC (gcc) [kamailio] core/fmsg.o
CC (gcc) [kamailio] core/mod_fix.o
CC (gcc) [kamailio] core/sr_compat.o
CC (gcc) [kamailio] core/crc.o
CC (gcc) [kamailio] core/data_lump_rpl.o
CC (gcc) [kamailio] core/error.o
CC (gcc) [kamailio] core/stun.o
CC (gcc) [kamailio] core/md5.o
CC (gcc) [kamailio] core/flags.o
CC (gcc) [kamailio] core/srapi.o
CC (gcc) [kamailio] core/lvalue.o
CC (gcc) [kamailio] core/sip_msg_clone.o
CC (gcc) [kamailio] core/ip_addr.o
CC (gcc) [kamailio] core/tcp_read.o
CC (gcc) [kamailio] core/dprint.o
CC (gcc) [kamailio] core/pt.o
CC (gcc) [kamailio] core/tcp_options.o
CC (gcc) [kamailio] core/nonsip_hooks.o
CC (gcc) [kamailio] core/pv_core.o
CC (gcc) [kamailio] core/id.o
CC (gcc) [kamailio] core/mem/shm_mem.o
CC (gcc) [kamailio] core/mem/pkg.o
CC (gcc) [kamailio] core/mem/sf_malloc.o
CC (gcc) [kamailio] core/mem/q_malloc.o
CC (gcc) [kamailio] core/mem/shm.o
CC (gcc) [kamailio] core/mem/ll_malloc.o
CC (gcc) [kamailio] core/mem/mem.o
CC (gcc) [kamailio] core/mem/tlsf_malloc.o
CC (gcc) [kamailio] core/mem/f_malloc.o
CC (gcc) [kamailio] core/mem/dl_malloc.o
CC (gcc) [kamailio] core/mem/memtest.o
CC (gcc) [kamailio] core/parser/parse_from.o
CC (gcc) [kamailio] core/parser/parse_param.o
CC (gcc) [kamailio] core/parser/parser_f.o
CC (gcc) [kamailio] core/parser/parse_subscription_state.o
CC (gcc) [kamailio] core/parser/parse_retry_after.o
CC (gcc) [kamailio] core/parser/parse_addr_spec.o
CC (gcc) [kamailio] core/parser/parse_rr.o
CC (gcc) [kamailio] core/parser/parse_allow.o
CC (gcc) [kamailio] core/parser/parse_diversion.o
CC (gcc) [kamailio] core/parser/parse_cseq.o
CC (gcc) [kamailio] core/parser/parse_content.o
CC (gcc) [kamailio] core/parser/parse_event.o
CC (gcc) [kamailio] core/parser/parse_uri.o
CC (gcc) [kamailio] core/parser/parse_disposition.o
CC (gcc) [kamailio] core/parser/parse_methods.o
CC (gcc) [kamailio] core/parser/parse_sipifmatch.o
CC (gcc) [kamailio] core/parser/parse_nameaddr.o
CC (gcc) [kamailio] core/parser/parse_body.o
CC (gcc) [kamailio] core/parser/hf.o
CC (gcc) [kamailio] core/parser/parse_via.o
CC (gcc) [kamailio] core/parser/parse_hname2.o
CC (gcc) [kamailio] core/parser/parse_supported.o
CC (gcc) [kamailio] core/parser/parse_rpid.o
CC (gcc) [kamailio] core/parser/parse_privacy.o
CC (gcc) [kamailio] core/parser/parse_identity.o
CC (gcc) [kamailio] core/parser/parse_option_tags.o
CC (gcc) [kamailio] core/parser/parse_fline.o
CC (gcc) [kamailio] core/parser/parse_hostport.o
CC (gcc) [kamailio] core/parser/parse_date.o
CC (gcc) [kamailio] core/parser/parse_require.o
CC (gcc) [kamailio] core/parser/parse_to.o
CC (gcc) [kamailio] core/parser/parse_ppi_pai.o
CC (gcc) [kamailio] core/parser/parse_identityinfo.o
CC (gcc) [kamailio] core/parser/parse_refer_to.o
CC (gcc) [kamailio] core/parser/parse_expires.o
CC (gcc) [kamailio] core/parser/msg_parser.o
CC (gcc) [kamailio] core/parser/digest/param_parser.o
CC (gcc) [kamailio] core/parser/digest/digest_parser.o
CC (gcc) [kamailio] core/parser/digest/digest.o
CC (gcc) [kamailio] core/parser/contact/contact.o
CC (gcc) [kamailio] core/parser/contact/parse_contact.o
CC (gcc) [kamailio] core/parser/sdp/sdp.o
CC (gcc) [kamailio] core/parser/sdp/sdp_helpr_funcs.o
CC (gcc) [kamailio] core/rand/fastrand.o
CC (gcc) [kamailio] core/rand/isaac/rand.o
CC (gcc) [kamailio] core/cfg/cfg_select.o
CC (gcc) [kamailio] core/cfg/cfg_ctx.o
CC (gcc) [kamailio] core/cfg/cfg_struct.o
CC (gcc) [kamailio] core/cfg/cfg_script.o
CC (gcc) [kamailio] core/cfg/cfg.o
bison -d -b core/cfg core/cfg.y
flex -o core/lex.yy.c core/cfg.lex
Build step 'Execute shell' marked build as failure
Archiving artifacts
ERROR: Step ‘Archive the artifacts’ aborted due to exception:
java.nio.file.NoSuchFileException: <https://kamailio.sipwise.com/job/kamailio51-nightly-binaries/architecture=amd64,distribution=buster,label=slave/84/artifact/kamailio-mongodb-modules_5.1.4+0~20180818021842.85+buster_amd64.deb>
        at sun.nio.fs.UnixException.translateToIOException(UnixException.java:86)
        at sun.nio.fs.UnixException.rethrowAsIOException(UnixException.java:102)
        at sun.nio.fs.UnixException.rethrowAsIOException(UnixException.java:107)
        at sun.nio.fs.UnixFileAttributeViews$Posix.readAttributes(UnixFileAttributeViews.java:218)
        at sun.nio.fs.UnixFileAttributeViews$Posix.readAttributes(UnixFileAttributeViews.java:131)
        at sun.nio.fs.UnixFileSystemProvider.readAttributes(UnixFileSystemProvider.java:144)
        at sun.nio.fs.LinuxFileSystemProvider.readAttributes(LinuxFileSystemProvider.java:99)
        at java.nio.file.Files.readAttributes(Files.java:1737)
        at java.nio.file.Files.getPosixFilePermissions(Files.java:2004)
        at hudson.util.IOUtils.mode(IOUtils.java:130)
Also:   hudson.remoting.Channel$CallSiteStackTrace: Remote call to jenkins-debian-glue-slave (i-098d9e2880d77bd0d)
                at hudson.remoting.Channel.attachCallSiteStackTrace(Channel.java:1741)
                at hudson.remoting.UserRequest$ExceptionResponse.retrieve(UserRequest.java:357)
                at hudson.remoting.Channel$2.adapt(Channel.java:990)
                at hudson.remoting.Channel$2.adapt(Channel.java:986)
                at hudson.remoting.FutureAdapter.get(FutureAdapter.java:55)
                at hudson.FilePath.copyRecursiveTo(FilePath.java:2375)
                at jenkins.model.StandardArtifactManager.archive(StandardArtifactManager.java:61)
                at hudson.tasks.ArtifactArchiver.perform(ArtifactArchiver.java:235)
                at hudson.tasks.BuildStepCompatibilityLayer.perform(BuildStepCompatibilityLayer.java:81)
                at hudson.tasks.BuildStepMonitor$1.perform(BuildStepMonitor.java:20)
                at hudson.model.AbstractBuild$AbstractBuildExecution.perform(AbstractBuild.java:744)
                at hudson.model.AbstractBuild$AbstractBuildExecution.performAllBuildSteps(AbstractBuild.java:690)
                at hudson.model.Build$BuildExecution.post2(Build.java:186)
                at hudson.model.AbstractBuild$AbstractBuildExecution.post(AbstractBuild.java:635)
                at hudson.model.Run.execute(Run.java:1823)
                at hudson.matrix.MatrixRun.run(MatrixRun.java:153)
                at hudson.model.ResourceController.execute(ResourceController.java:97)
                at hudson.model.Executor.run(Executor.java:429)
Caused: hudson.os.PosixException: Unable to get file permissions null
        at hudson.util.IOUtils.mode(IOUtils.java:133)
        at hudson.util.io.TarArchiver.visit(TarArchiver.java:92)
        at hudson.util.DirScanner.scanSingle(DirScanner.java:44)
        at hudson.FilePath$ExplicitlySpecifiedDirScanner.scan(FilePath.java:2995)
        at hudson.FilePath.writeToTar(FilePath.java:2432)
        at hudson.FilePath.access$2800(FilePath.java:210)
        at hudson.FilePath$CopyRecursiveRemoteToLocal.invoke(FilePath.java:2397)
        at hudson.FilePath$CopyRecursiveRemoteToLocal.invoke(FilePath.java:2386)
        at hudson.FilePath$FileCallableWrapper.call(FilePath.java:2917)
        at hudson.remoting.UserRequest.perform(UserRequest.java:212)
        at hudson.remoting.UserRequest.perform(UserRequest.java:54)
        at hudson.remoting.Request$2.run(Request.java:369)
        at hudson.remoting.InterceptingExecutorService$1.call(InterceptingExecutorService.java:72)
        at java.util.concurrent.FutureTask.run(FutureTask.java:266)
        at java.util.concurrent.ThreadPoolExecutor.runWorker(ThreadPoolExecutor.java:1149)
        at java.util.concurrent.ThreadPoolExecutor$Worker.run(ThreadPoolExecutor.java:624)
        at java.lang.Thread.run(Thread.java:748)
Caused: java.io.IOException
        at hudson.FilePath.copyRecursiveTo(FilePath.java:2379)
        at jenkins.model.StandardArtifactManager.archive(StandardArtifactManager.java:61)
        at hudson.tasks.ArtifactArchiver.perform(ArtifactArchiver.java:235)
        at hudson.tasks.BuildStepCompatibilityLayer.perform(BuildStepCompatibilityLayer.java:81)
        at hudson.tasks.BuildStepMonitor$1.perform(BuildStepMonitor.java:20)
        at hudson.model.AbstractBuild$AbstractBuildExecution.perform(AbstractBuild.java:744)
        at hudson.model.AbstractBuild$AbstractBuildExecution.performAllBuildSteps(AbstractBuild.java:690)
        at hudson.model.Build$BuildExecution.post2(Build.java:186)
        at hudson.model.AbstractBuild$AbstractBuildExecution.post(AbstractBuild.java:635)
        at hudson.model.Run.execute(Run.java:1823)
        at hudson.matrix.MatrixRun.run(MatrixRun.java:153)
        at hudson.model.ResourceController.execute(ResourceController.java:97)
        at hudson.model.Executor.run(Executor.java:429)
TAP Reports Processing: START
Looking for TAP results report in workspace using pattern: report/*.tap
ERROR: Step ‘Publish TAP Results’ aborted due to exception:
Also:   hudson.remoting.Channel$CallSiteStackTrace: Remote call to jenkins-debian-glue-slave (i-098d9e2880d77bd0d)
                at hudson.remoting.Channel.attachCallSiteStackTrace(Channel.java:1741)
                at hudson.remoting.UserRequest$ExceptionResponse.retrieve(UserRequest.java:357)
                at hudson.remoting.Channel.call(Channel.java:955)
                at hudson.FilePath.act(FilePath.java:1036)
                at hudson.FilePath.act(FilePath.java:1025)
                at hudson.FilePath.list(FilePath.java:1840)
                at hudson.FilePath.list(FilePath.java:1824)
                at hudson.FilePath.list(FilePath.java:1809)
                at org.tap4j.plugin.TapPublisher.locateReports(TapPublisher.java:647)
                at org.tap4j.plugin.TapPublisher.performImpl(TapPublisher.java:383)
                at org.tap4j.plugin.TapPublisher.perform(TapPublisher.java:371)
                at hudson.tasks.BuildStepCompatibilityLayer.perform(BuildStepCompatibilityLayer.java:81)
                at hudson.tasks.BuildStepMonitor$1.perform(BuildStepMonitor.java:20)
                at hudson.model.AbstractBuild$AbstractBuildExecution.perform(AbstractBuild.java:744)
                at hudson.model.AbstractBuild$AbstractBuildExecution.performAllBuildSteps(AbstractBuild.java:690)
                at hudson.model.Build$BuildExecution.post2(Build.java:186)
                at hudson.model.AbstractBuild$AbstractBuildExecution.post(AbstractBuild.java:635)
                at hudson.model.Run.execute(Run.java:1823)
                at hudson.matrix.MatrixRun.run(MatrixRun.java:153)
                at hudson.model.ResourceController.execute(ResourceController.java:97)
                at hudson.model.Executor.run(Executor.java:429)
java.io.IOException: <https://kamailio.sipwise.com/job/kamailio51-nightly-binaries/architecture=amd64,distribution=buster,label=slave/ws/> does not exist.
        at hudson.FilePath.glob(FilePath.java:1870)
        at hudson.FilePath.access$2400(FilePath.java:210)
        at hudson.FilePath$23.invoke(FilePath.java:1843)
        at hudson.FilePath$23.invoke(FilePath.java:1840)
        at hudson.FilePath$FileCallableWrapper.call(FilePath.java:2917)
        at hudson.remoting.UserRequest.perform(UserRequest.java:212)
        at hudson.remoting.UserRequest.perform(UserRequest.java:54)
        at hudson.remoting.Request$2.run(Request.java:369)
        at hudson.remoting.InterceptingExecutorService$1.call(InterceptingExecutorService.java:72)
        at java.util.concurrent.FutureTask.run(FutureTask.java:266)
        at java.util.concurrent.ThreadPoolExecutor.runWorker(ThreadPoolExecutor.java:1149)
        at java.util.concurrent.ThreadPoolExecutor$Worker.run(ThreadPoolExecutor.java:624)
        at java.lang.Thread.run(Thread.java:748)
Recording test results
ERROR: Build step failed with exception
Also:   hudson.remoting.Channel$CallSiteStackTrace: Remote call to jenkins-debian-glue-slave (i-098d9e2880d77bd0d)
                at hudson.remoting.Channel.attachCallSiteStackTrace(Channel.java:1741)
                at hudson.remoting.UserRequest$ExceptionResponse.retrieve(UserRequest.java:357)
                at hudson.remoting.Channel.call(Channel.java:955)
                at hudson.FilePath.act(FilePath.java:1036)
                at hudson.FilePath.act(FilePath.java:1025)
                at hudson.tasks.junit.JUnitParser.parseResult(JUnitParser.java:114)
                at hudson.tasks.junit.JUnitResultArchiver.parse(JUnitResultArchiver.java:136)
                at hudson.tasks.junit.JUnitResultArchiver.parseAndAttach(JUnitResultArchiver.java:166)
                at hudson.tasks.junit.JUnitResultArchiver.perform(JUnitResultArchiver.java:153)
                at hudson.tasks.BuildStepCompatibilityLayer.perform(BuildStepCompatibilityLayer.java:81)
                at hudson.tasks.BuildStepMonitor$1.perform(BuildStepMonitor.java:20)
                at hudson.model.AbstractBuild$AbstractBuildExecution.perform(AbstractBuild.java:744)
                at hudson.model.AbstractBuild$AbstractBuildExecution.performAllBuildSteps(AbstractBuild.java:690)
                at hudson.model.Build$BuildExecution.post2(Build.java:186)
                at hudson.model.AbstractBuild$AbstractBuildExecution.post(AbstractBuild.java:635)
                at hudson.model.Run.execute(Run.java:1823)
                at hudson.matrix.MatrixRun.run(MatrixRun.java:153)
                at hudson.model.ResourceController.execute(ResourceController.java:97)
                at hudson.model.Executor.run(Executor.java:429)
<https://kamailio.sipwise.com/job/kamailio51-nightly-binaries/architecture=amd64,distribution=buster,label=slave/ws/> does not exist.
        at org.apache.tools.ant.types.AbstractFileSet.getDirectoryScanner(AbstractFileSet.java:484)
        at org.apache.tools.ant.types.AbstractFileSet.getDirectoryScanner(AbstractFileSet.java:461)
        at hudson.tasks.junit.JUnitParser$ParseResultCallable.invoke(JUnitParser.java:141)
        at hudson.tasks.junit.JUnitParser$ParseResultCallable.invoke(JUnitParser.java:118)
        at hudson.FilePath$FileCallableWrapper.call(FilePath.java:2917)
        at hudson.remoting.UserRequest.perform(UserRequest.java:212)
        at hudson.remoting.UserRequest.perform(UserRequest.java:54)
        at hudson.remoting.Request$2.run(Request.java:369)
        at hudson.remoting.InterceptingExecutorService$1.call(InterceptingExecutorService.java:72)
        at java.util.concurrent.FutureTask.run(FutureTask.java:266)
        at java.util.concurrent.ThreadPoolExecutor.runWorker(ThreadPoolExecutor.java:1149)
        at java.util.concurrent.ThreadPoolExecutor$Worker.run(ThreadPoolExecutor.java:624)
        at java.lang.Thread.run(Thread.java:748)
Build step 'Publish JUnit test result report' marked build as failure

_______________________________________________
Kamailio (SER) - Development Mailing List
[hidden email]
https://lists.kamailio.org/cgi-bin/mailman/listinfo/sr-dev
Reply | Threaded
Open this post in threaded view
|

[sr-dev] Jenkins build is back to normal : kamailio51-nightly-binaries » amd64,buster,slave #85

jenkins-2