[sr-dev] Build failed in Jenkins: kamailio51-nightly-binaries » amd64,stretch,slave #84

classic Classic list List threaded Threaded
2 messages Options
Reply | Threaded
Open this post in threaded view
|

[sr-dev] Build failed in Jenkins: kamailio51-nightly-binaries » amd64,stretch,slave #84

jenkins-2
See <https://kamailio.sipwise.com/job/kamailio51-nightly-binaries/architecture=amd64,distribution=stretch,label=slave/84/display/redirect>

------------------------------------------
[...truncated 642.63 KB...]
CC (gcc) [M presence.so] presentity.o
CC (gcc) [M presence.so] hash.o
CC (gcc) [M presence.so] event_list.o
CC (gcc) [M presence.so] notify.o
make[4]: 'libsrdb1.so.1.0' is up to date.
LD (gcc) [M presence.so] presence.so
CC (gcc) [M presence_conference.so] notify_body.o
CC (gcc) [M presence_conference.so] pidf.o
CC (gcc) [M presence_conference.so] presence_conference.o
CC (gcc) [M presence_conference.so] add_events.o
LD (gcc) [M presence_conference.so] presence_conference.so
CC (gcc) [M presence_dialoginfo.so] notify_body.o
CC (gcc) [M presence_dialoginfo.so] presence_dialoginfo.o
CC (gcc) [M presence_dialoginfo.so] pidf.o
CC (gcc) [M presence_dialoginfo.so] add_events.o
LD (gcc) [M presence_dialoginfo.so] presence_dialoginfo.so
CC (gcc) [M presence_mwi.so] presence_mwi.o
CC (gcc) [M presence_mwi.so] add_events.o
LD (gcc) [M presence_mwi.so] presence_mwi.so
CC (gcc) [M presence_profile.so] presence_profile.o
CC (gcc) [M presence_profile.so] add_events.o
LD (gcc) [M presence_profile.so] presence_profile.so
CC (gcc) [M presence_reginfo.so] presence_reginfo.o
CC (gcc) [M presence_reginfo.so] add_events.o
LD (gcc) [M presence_reginfo.so] presence_reginfo.so
CC (gcc) [M presence_xml.so] notify_body.o
CC (gcc) [M presence_xml.so] xcap_auth.o
CC (gcc) [M presence_xml.so] pidf.o
CC (gcc) [M presence_xml.so] presence_xml.o
CC (gcc) [M presence_xml.so] pres_check.o
CC (gcc) [M presence_xml.so] add_events.o
make[4]: 'libsrdb1.so.1.0' is up to date.
LD (gcc) [M presence_xml.so] presence_xml.so
CC (gcc) [M pua.so] pua_db.o
CC (gcc) [M pua.so] pua_callback.o
CC (gcc) [M pua.so] pidf.o
CC (gcc) [M pua.so] send_subscribe.o
CC (gcc) [M pua.so] hash.o
CC (gcc) [M pua.so] pua.o
CC (gcc) [M pua.so] event_list.o
CC (gcc) [M pua.so] pua_bind.o
CC (gcc) [M pua.so] send_publish.o
CC (gcc) [M pua.so] add_events.o
make[4]: 'libsrdb1.so.1.0' is up to date.
LD (gcc) [M pua.so] pua.so
CC (gcc) [M pua_bla.so] registrar_cb.o
CC (gcc) [M pua_bla.so] pua_bla.o
CC (gcc) [M pua_bla.so] notify.o
LD (gcc) [M pua_bla.so] pua_bla.so
CC (gcc) [M pua_dialoginfo.so] pua_dialoginfo.o
CC (gcc) [M pua_dialoginfo.so] dialog_publish.o
LD (gcc) [M pua_dialoginfo.so] pua_dialoginfo.so
CC (gcc) [M pua_reginfo.so] pua_reginfo.o
CC (gcc) [M pua_reginfo.so] subscribe.o
CC (gcc) [M pua_reginfo.so] usrloc_cb.o
CC (gcc) [M pua_reginfo.so] notify.o
make[4]: 'libsrutils.so.1.0' is up to date.
LD (gcc) [M pua_reginfo.so] pua_reginfo.so
CC (gcc) [M pua_rpc.so] pua_rpc.o
LD (gcc) [M pua_rpc.so] pua_rpc.so
CC (gcc) [M pua_usrloc.so] ul_publish.o
CC (gcc) [M pua_usrloc.so] pua_usrloc.o
LD (gcc) [M pua_usrloc.so] pua_usrloc.so
CC (gcc) [M pua_xmpp.so] request_winfo.o
CC (gcc) [M pua_xmpp.so] xmpp2simple.o
CC (gcc) [M pua_xmpp.so] pidf.o
CC (gcc) [M pua_xmpp.so] simple2xmpp.o
CC (gcc) [M pua_xmpp.so] pua_xmpp.o
LD (gcc) [M pua_xmpp.so] pua_xmpp.so
CC (gcc) [M rls.so] subscribe.o
CC (gcc) [M rls.so] rls.o
CC (gcc) [M rls.so] utils.o
CC (gcc) [M rls.so] rls_db.o
CC (gcc) [M rls.so] resource_notify.o
CC (gcc) [M rls.so] notify.o
make[4]: 'libsrdb1.so.1.0' is up to date.
LD (gcc) [M rls.so] rls.so
CC (gcc) [M xcap_client.so] xcap_callbacks.o
CC (gcc) [M xcap_client.so] xcap_functions.o
CC (gcc) [M xcap_client.so] xcap_client.o
make[4]: 'libsrdb1.so.1.0' is up to date.
LD (gcc) [M xcap_client.so] xcap_client.so
CC (gcc) [M xcap_server.so] xcap_server.o
CC (gcc) [M xcap_server.so] xcap_misc.o
make[4]: 'libsrdb1.so.1.0' is up to date.
LD (gcc) [M xcap_server.so] xcap_server.so
make[2]: Leaving directory '/tmp/buildd/kamailio-5.1.4+0~20180818022305.85+stretch/src'
make[1]: Leaving directory '/tmp/buildd/kamailio-5.1.4+0~20180818022305.85+stretch'
/usr/bin/make every-module group_include="kldap"
make[1]: Entering directory '/tmp/buildd/kamailio-5.1.4+0~20180818022305.85+stretch'
/usr/bin/make -C src/ every-module
make[2]: Entering directory '/tmp/buildd/kamailio-5.1.4+0~20180818022305.85+stretch/src'
CC (gcc) [M db2_ldap.so] ld_res.o
CC (gcc) [M db2_ldap.so] ld_cfg.o
CC (gcc) [M db2_ldap.so] ld_uri.o
CC (gcc) [M db2_ldap.so] db2_ldap_mod.o
CC (gcc) [M db2_ldap.so] ld_cmd.o
CC (gcc) [M db2_ldap.so] ld_fld.o
CC (gcc) [M db2_ldap.so] ld_con.o
make[4]: 'libsrdb2.so.1.0' is up to date.
LD (gcc) [M db2_ldap.so] db2_ldap.so
CC (gcc) [M h350.so] h350_exp_fn.o
CC (gcc) [M h350.so] h350_mod.o
LD (gcc) [M h350.so] h350.so
CC (gcc) [M ldap.so] ldap_exp_fn.o
CC (gcc) [M ldap.so] ldap_connect.o
CC (gcc) [M ldap.so] ldap_mod.o
CC (gcc) [M ldap.so] ld_session.o
Build step 'Execute shell' marked build as failure
Archiving artifacts
ERROR: Step ‘Archive the artifacts’ aborted due to exception:
java.nio.file.NoSuchFileException: <https://kamailio.sipwise.com/job/kamailio51-nightly-binaries/architecture=amd64,distribution=stretch,label=slave/84/artifact/lintian.txt>
        at sun.nio.fs.UnixException.translateToIOException(UnixException.java:86)
        at sun.nio.fs.UnixException.rethrowAsIOException(UnixException.java:102)
        at sun.nio.fs.UnixException.rethrowAsIOException(UnixException.java:107)
        at sun.nio.fs.UnixFileAttributeViews$Posix.readAttributes(UnixFileAttributeViews.java:218)
        at sun.nio.fs.UnixFileAttributeViews$Posix.readAttributes(UnixFileAttributeViews.java:131)
        at sun.nio.fs.UnixFileSystemProvider.readAttributes(UnixFileSystemProvider.java:144)
        at sun.nio.fs.LinuxFileSystemProvider.readAttributes(LinuxFileSystemProvider.java:99)
        at java.nio.file.Files.readAttributes(Files.java:1737)
        at java.nio.file.Files.getPosixFilePermissions(Files.java:2004)
        at hudson.util.IOUtils.mode(IOUtils.java:130)
Also:   hudson.remoting.Channel$CallSiteStackTrace: Remote call to jenkins-debian-glue-slave (i-098d9e2880d77bd0d)
                at hudson.remoting.Channel.attachCallSiteStackTrace(Channel.java:1741)
                at hudson.remoting.UserRequest$ExceptionResponse.retrieve(UserRequest.java:357)
                at hudson.remoting.Channel$2.adapt(Channel.java:990)
                at hudson.remoting.Channel$2.adapt(Channel.java:986)
                at hudson.remoting.FutureAdapter.get(FutureAdapter.java:55)
                at hudson.FilePath.copyRecursiveTo(FilePath.java:2375)
                at jenkins.model.StandardArtifactManager.archive(StandardArtifactManager.java:61)
                at hudson.tasks.ArtifactArchiver.perform(ArtifactArchiver.java:235)
                at hudson.tasks.BuildStepCompatibilityLayer.perform(BuildStepCompatibilityLayer.java:81)
                at hudson.tasks.BuildStepMonitor$1.perform(BuildStepMonitor.java:20)
                at hudson.model.AbstractBuild$AbstractBuildExecution.perform(AbstractBuild.java:744)
                at hudson.model.AbstractBuild$AbstractBuildExecution.performAllBuildSteps(AbstractBuild.java:690)
                at hudson.model.Build$BuildExecution.post2(Build.java:186)
                at hudson.model.AbstractBuild$AbstractBuildExecution.post(AbstractBuild.java:635)
                at hudson.model.Run.execute(Run.java:1823)
                at hudson.matrix.MatrixRun.run(MatrixRun.java:153)
                at hudson.model.ResourceController.execute(ResourceController.java:97)
                at hudson.model.Executor.run(Executor.java:429)
Caused: hudson.os.PosixException: Unable to get file permissions null
        at hudson.util.IOUtils.mode(IOUtils.java:133)
        at hudson.util.io.TarArchiver.visit(TarArchiver.java:92)
        at hudson.util.DirScanner.scanSingle(DirScanner.java:44)
        at hudson.FilePath$ExplicitlySpecifiedDirScanner.scan(FilePath.java:2995)
        at hudson.FilePath.writeToTar(FilePath.java:2432)
        at hudson.FilePath.access$2800(FilePath.java:210)
        at hudson.FilePath$CopyRecursiveRemoteToLocal.invoke(FilePath.java:2397)
        at hudson.FilePath$CopyRecursiveRemoteToLocal.invoke(FilePath.java:2386)
        at hudson.FilePath$FileCallableWrapper.call(FilePath.java:2917)
        at hudson.remoting.UserRequest.perform(UserRequest.java:212)
        at hudson.remoting.UserRequest.perform(UserRequest.java:54)
        at hudson.remoting.Request$2.run(Request.java:369)
        at hudson.remoting.InterceptingExecutorService$1.call(InterceptingExecutorService.java:72)
        at java.util.concurrent.FutureTask.run(FutureTask.java:266)
        at java.util.concurrent.ThreadPoolExecutor.runWorker(ThreadPoolExecutor.java:1149)
        at java.util.concurrent.ThreadPoolExecutor$Worker.run(ThreadPoolExecutor.java:624)
        at java.lang.Thread.run(Thread.java:748)
Caused: java.io.IOException
        at hudson.FilePath.copyRecursiveTo(FilePath.java:2379)
        at jenkins.model.StandardArtifactManager.archive(StandardArtifactManager.java:61)
        at hudson.tasks.ArtifactArchiver.perform(ArtifactArchiver.java:235)
        at hudson.tasks.BuildStepCompatibilityLayer.perform(BuildStepCompatibilityLayer.java:81)
        at hudson.tasks.BuildStepMonitor$1.perform(BuildStepMonitor.java:20)
        at hudson.model.AbstractBuild$AbstractBuildExecution.perform(AbstractBuild.java:744)
        at hudson.model.AbstractBuild$AbstractBuildExecution.performAllBuildSteps(AbstractBuild.java:690)
        at hudson.model.Build$BuildExecution.post2(Build.java:186)
        at hudson.model.AbstractBuild$AbstractBuildExecution.post(AbstractBuild.java:635)
        at hudson.model.Run.execute(Run.java:1823)
        at hudson.matrix.MatrixRun.run(MatrixRun.java:153)
        at hudson.model.ResourceController.execute(ResourceController.java:97)
        at hudson.model.Executor.run(Executor.java:429)
TAP Reports Processing: START
Looking for TAP results report in workspace using pattern: report/*.tap
ERROR: Step ‘Publish TAP Results’ aborted due to exception:
Also:   hudson.remoting.Channel$CallSiteStackTrace: Remote call to jenkins-debian-glue-slave (i-098d9e2880d77bd0d)
                at hudson.remoting.Channel.attachCallSiteStackTrace(Channel.java:1741)
                at hudson.remoting.UserRequest$ExceptionResponse.retrieve(UserRequest.java:357)
                at hudson.remoting.Channel.call(Channel.java:955)
                at hudson.FilePath.act(FilePath.java:1036)
                at hudson.FilePath.act(FilePath.java:1025)
                at hudson.FilePath.list(FilePath.java:1840)
                at hudson.FilePath.list(FilePath.java:1824)
                at hudson.FilePath.list(FilePath.java:1809)
                at org.tap4j.plugin.TapPublisher.locateReports(TapPublisher.java:647)
                at org.tap4j.plugin.TapPublisher.performImpl(TapPublisher.java:383)
                at org.tap4j.plugin.TapPublisher.perform(TapPublisher.java:371)
                at hudson.tasks.BuildStepCompatibilityLayer.perform(BuildStepCompatibilityLayer.java:81)
                at hudson.tasks.BuildStepMonitor$1.perform(BuildStepMonitor.java:20)
                at hudson.model.AbstractBuild$AbstractBuildExecution.perform(AbstractBuild.java:744)
                at hudson.model.AbstractBuild$AbstractBuildExecution.performAllBuildSteps(AbstractBuild.java:690)
                at hudson.model.Build$BuildExecution.post2(Build.java:186)
                at hudson.model.AbstractBuild$AbstractBuildExecution.post(AbstractBuild.java:635)
                at hudson.model.Run.execute(Run.java:1823)
                at hudson.matrix.MatrixRun.run(MatrixRun.java:153)
                at hudson.model.ResourceController.execute(ResourceController.java:97)
                at hudson.model.Executor.run(Executor.java:429)
java.io.IOException: <https://kamailio.sipwise.com/job/kamailio51-nightly-binaries/architecture=amd64,distribution=stretch,label=slave/ws/> does not exist.
        at hudson.FilePath.glob(FilePath.java:1870)
        at hudson.FilePath.access$2400(FilePath.java:210)
        at hudson.FilePath$23.invoke(FilePath.java:1843)
        at hudson.FilePath$23.invoke(FilePath.java:1840)
        at hudson.FilePath$FileCallableWrapper.call(FilePath.java:2917)
        at hudson.remoting.UserRequest.perform(UserRequest.java:212)
        at hudson.remoting.UserRequest.perform(UserRequest.java:54)
        at hudson.remoting.Request$2.run(Request.java:369)
        at hudson.remoting.InterceptingExecutorService$1.call(InterceptingExecutorService.java:72)
        at java.util.concurrent.FutureTask.run(FutureTask.java:266)
        at java.util.concurrent.ThreadPoolExecutor.runWorker(ThreadPoolExecutor.java:1149)
        at java.util.concurrent.ThreadPoolExecutor$Worker.run(ThreadPoolExecutor.java:624)
        at java.lang.Thread.run(Thread.java:748)
Recording test results
ERROR: Build step failed with exception
Also:   hudson.remoting.Channel$CallSiteStackTrace: Remote call to jenkins-debian-glue-slave (i-098d9e2880d77bd0d)
                at hudson.remoting.Channel.attachCallSiteStackTrace(Channel.java:1741)
                at hudson.remoting.UserRequest$ExceptionResponse.retrieve(UserRequest.java:357)
                at hudson.remoting.Channel.call(Channel.java:955)
                at hudson.FilePath.act(FilePath.java:1036)
                at hudson.FilePath.act(FilePath.java:1025)
                at hudson.tasks.junit.JUnitParser.parseResult(JUnitParser.java:114)
                at hudson.tasks.junit.JUnitResultArchiver.parse(JUnitResultArchiver.java:136)
                at hudson.tasks.junit.JUnitResultArchiver.parseAndAttach(JUnitResultArchiver.java:166)
                at hudson.tasks.junit.JUnitResultArchiver.perform(JUnitResultArchiver.java:153)
                at hudson.tasks.BuildStepCompatibilityLayer.perform(BuildStepCompatibilityLayer.java:81)
                at hudson.tasks.BuildStepMonitor$1.perform(BuildStepMonitor.java:20)
                at hudson.model.AbstractBuild$AbstractBuildExecution.perform(AbstractBuild.java:744)
                at hudson.model.AbstractBuild$AbstractBuildExecution.performAllBuildSteps(AbstractBuild.java:690)
                at hudson.model.Build$BuildExecution.post2(Build.java:186)
                at hudson.model.AbstractBuild$AbstractBuildExecution.post(AbstractBuild.java:635)
                at hudson.model.Run.execute(Run.java:1823)
                at hudson.matrix.MatrixRun.run(MatrixRun.java:153)
                at hudson.model.ResourceController.execute(ResourceController.java:97)
                at hudson.model.Executor.run(Executor.java:429)
<https://kamailio.sipwise.com/job/kamailio51-nightly-binaries/architecture=amd64,distribution=stretch,label=slave/ws/> does not exist.
        at org.apache.tools.ant.types.AbstractFileSet.getDirectoryScanner(AbstractFileSet.java:484)
        at org.apache.tools.ant.types.AbstractFileSet.getDirectoryScanner(AbstractFileSet.java:461)
        at hudson.tasks.junit.JUnitParser$ParseResultCallable.invoke(JUnitParser.java:141)
        at hudson.tasks.junit.JUnitParser$ParseResultCallable.invoke(JUnitParser.java:118)
        at hudson.FilePath$FileCallableWrapper.call(FilePath.java:2917)
        at hudson.remoting.UserRequest.perform(UserRequest.java:212)
        at hudson.remoting.UserRequest.perform(UserRequest.java:54)
        at hudson.remoting.Request$2.run(Request.java:369)
        at hudson.remoting.InterceptingExecutorService$1.call(InterceptingExecutorService.java:72)
        at java.util.concurrent.FutureTask.run(FutureTask.java:266)
        at java.util.concurrent.ThreadPoolExecutor.runWorker(ThreadPoolExecutor.java:1149)
        at java.util.concurrent.ThreadPoolExecutor$Worker.run(ThreadPoolExecutor.java:624)
        at java.lang.Thread.run(Thread.java:748)
Build step 'Publish JUnit test result report' marked build as failure

_______________________________________________
Kamailio (SER) - Development Mailing List
[hidden email]
https://lists.kamailio.org/cgi-bin/mailman/listinfo/sr-dev
Reply | Threaded
Open this post in threaded view
|

[sr-dev] Jenkins build is back to normal : kamailio51-nightly-binaries » amd64,stretch,slave #85

jenkins-2