[sr-dev] Build failed in Jenkins: kamailiodev-nightly-binaries » amd64,stretch,slave #1166

classic Classic list List threaded Threaded
3 messages Options
Reply | Threaded
Open this post in threaded view
|

[sr-dev] Build failed in Jenkins: kamailiodev-nightly-binaries » amd64,stretch,slave #1166

jenkins-2
See <https://kamailio.sipwise.com/job/kamailiodev-nightly-binaries/architecture=amd64,distribution=stretch,label=slave/1166/display/redirect>

------------------------------------------
[...truncated 1.29 MB...]
-rw-r--r-- root/root        83 2018-08-18 01:01 ./usr/share/kamailio/dbtext/kamailio/dialog_vars
-rw-r--r-- root/root       128 2018-08-18 01:01 ./usr/share/kamailio/dbtext/kamailio/dialplan
-rw-r--r-- root/root       104 2018-08-18 01:01 ./usr/share/kamailio/dbtext/kamailio/dispatcher
-rw-r--r-- root/root        65 2018-08-18 01:01 ./usr/share/kamailio/dbtext/kamailio/domain
-rw-r--r-- root/root        82 2018-08-18 01:01 ./usr/share/kamailio/dbtext/kamailio/domain_attrs
-rw-r--r-- root/root        34 2018-08-18 01:01 ./usr/share/kamailio/dbtext/kamailio/domain_name
-rw-r--r-- root/root        94 2018-08-18 01:01 ./usr/share/kamailio/dbtext/kamailio/domainpolicy
-rw-r--r-- root/root       116 2018-08-18 01:01 ./usr/share/kamailio/dbtext/kamailio/dr_gateways
-rw-r--r-- root/root        79 2018-08-18 01:01 ./usr/share/kamailio/dbtext/kamailio/dr_groups
-rw-r--r-- root/root        49 2018-08-18 01:01 ./usr/share/kamailio/dbtext/kamailio/dr_gw_lists
-rw-r--r-- root/root       130 2018-08-18 01:01 ./usr/share/kamailio/dbtext/kamailio/dr_rules
-rw-r--r-- root/root        69 2018-08-18 01:01 ./usr/share/kamailio/dbtext/kamailio/globalblacklist
-rw-r--r-- root/root        77 2018-08-18 01:01 ./usr/share/kamailio/dbtext/kamailio/grp
-rw-r--r-- root/root        92 2018-08-18 01:01 ./usr/share/kamailio/dbtext/kamailio/htable
-rw-r--r-- root/root        69 2018-08-18 01:01 ./usr/share/kamailio/dbtext/kamailio/imc_members
-rw-r--r-- root/root        52 2018-08-18 01:01 ./usr/share/kamailio/dbtext/kamailio/imc_rooms
-rw-r--r-- root/root       248 2018-08-18 01:01 ./usr/share/kamailio/dbtext/kamailio/lcr_gw
-rw-r--r-- root/root       142 2018-08-18 01:01 ./usr/share/kamailio/dbtext/kamailio/lcr_rule
-rw-r--r-- root/root        76 2018-08-18 01:01 ./usr/share/kamailio/dbtext/kamailio/lcr_rule_target
-rw-r--r-- root/root       365 2018-08-18 01:01 ./usr/share/kamailio/dbtext/kamailio/location
-rw-r--r-- root/root       123 2018-08-18 01:01 ./usr/share/kamailio/dbtext/kamailio/location_attrs
-rw-r--r-- root/root        33 2018-08-18 01:01 ./usr/share/kamailio/dbtext/kamailio/matrix
-rw-r--r-- root/root       122 2018-08-18 01:01 ./usr/share/kamailio/dbtext/kamailio/missed_calls
-rw-r--r-- root/root       119 2018-08-18 01:01 ./usr/share/kamailio/dbtext/kamailio/mohqcalls
-rw-r--r-- root/root        86 2018-08-18 01:01 ./usr/share/kamailio/dbtext/kamailio/mohqueues
-rw-r--r-- root/root        45 2018-08-18 01:01 ./usr/share/kamailio/dbtext/kamailio/mtree
-rw-r--r-- root/root        59 2018-08-18 01:01 ./usr/share/kamailio/dbtext/kamailio/mtrees
-rw-r--r-- root/root        60 2018-08-18 01:01 ./usr/share/kamailio/dbtext/kamailio/pdt
-rw-r--r-- root/root        59 2018-08-18 01:01 ./usr/share/kamailio/dbtext/kamailio/pl_pipes
-rw-r--r-- root/root       165 2018-08-18 01:01 ./usr/share/kamailio/dbtext/kamailio/presentity
-rw-r--r-- root/root       315 2018-08-18 01:01 ./usr/share/kamailio/dbtext/kamailio/pua
-rw-r--r-- root/root        87 2018-08-18 01:01 ./usr/share/kamailio/dbtext/kamailio/purplemap
-rw-r--r-- root/root        44 2018-08-18 01:01 ./usr/share/kamailio/dbtext/kamailio/re_grp
-rw-r--r-- root/root       155 2018-08-18 01:01 ./usr/share/kamailio/dbtext/kamailio/rls_presentity
-rw-r--r-- root/root       423 2018-08-18 01:01 ./usr/share/kamailio/dbtext/kamailio/rls_watchers
-rw-r--r-- root/root        74 2018-08-18 01:01 ./usr/share/kamailio/dbtext/kamailio/rtpengine
-rw-r--r-- root/root        83 2018-08-18 01:01 ./usr/share/kamailio/dbtext/kamailio/rtpproxy
-rw-r--r-- root/root       219 2018-08-18 01:01 ./usr/share/kamailio/dbtext/kamailio/sca_subscriptions
-rw-r--r-- root/root       205 2018-08-18 01:01 ./usr/share/kamailio/dbtext/kamailio/silo
-rw-r--r-- root/root       196 2018-08-18 01:01 ./usr/share/kamailio/dbtext/kamailio/sip_trace
-rw-r--r-- root/root       148 2018-08-18 01:01 ./usr/share/kamailio/dbtext/kamailio/speed_dial
-rw-r--r-- root/root       133 2018-08-18 01:01 ./usr/share/kamailio/dbtext/kamailio/subscriber
-rw-r--r-- root/root       386 2018-08-18 01:01 ./usr/share/kamailio/dbtext/kamailio/topos_d
-rw-r--r-- root/root       412 2018-08-18 01:01 ./usr/share/kamailio/dbtext/kamailio/topos_t
-rw-r--r-- root/root       126 2018-08-18 01:01 ./usr/share/kamailio/dbtext/kamailio/trusted
-rw-r--r-- root/root       234 2018-08-18 01:01 ./usr/share/kamailio/dbtext/kamailio/uacreg
-rw-r--r-- root/root       127 2018-08-18 01:01 ./usr/share/kamailio/dbtext/kamailio/uid_credentials
-rw-r--r-- root/root        52 2018-08-18 01:01 ./usr/share/kamailio/dbtext/kamailio/uid_domain
-rw-r--r-- root/root        84 2018-08-18 01:01 ./usr/share/kamailio/dbtext/kamailio/uid_domain_attrs
-rw-r--r-- root/root        67 2018-08-18 01:01 ./usr/share/kamailio/dbtext/kamailio/uid_global_attrs
-rw-r--r-- root/root        81 2018-08-18 01:01 ./usr/share/kamailio/dbtext/kamailio/uid_uri
-rw-r--r-- root/root       111 2018-08-18 01:01 ./usr/share/kamailio/dbtext/kamailio/uid_uri_attrs
-rw-r--r-- root/root        79 2018-08-18 01:01 ./usr/share/kamailio/dbtext/kamailio/uid_user_attrs
-rw-r--r-- root/root        82 2018-08-18 01:01 ./usr/share/kamailio/dbtext/kamailio/uri
-rw-r--r-- root/root        76 2018-08-18 01:01 ./usr/share/kamailio/dbtext/kamailio/userblacklist
-rw-r--r-- root/root       120 2018-08-18 01:01 ./usr/share/kamailio/dbtext/kamailio/usr_preferences
-rw-r--r-- root/root       902 2018-08-18 01:01 ./usr/share/kamailio/dbtext/kamailio/version
-rw-r--r-- root/root       150 2018-08-18 01:01 ./usr/share/kamailio/dbtext/kamailio/watchers
-rw-r--r-- root/root       123 2018-08-18 01:01 ./usr/share/kamailio/dbtext/kamailio/xcap
drwxr-xr-x root/root         0 2018-08-18 01:01 ./usr/share/lintian/
drwxr-xr-x root/root         0 2018-08-18 01:01 ./usr/share/lintian/overrides/
-rw-r--r-- root/root       227 2018-03-28 00:56 ./usr/share/lintian/overrides/kamailio
drwxr-xr-x root/root         0 2018-08-18 01:01 ./usr/share/man/
drwxr-xr-x root/root         0 2018-08-18 01:01 ./usr/share/man/man5/
-rw-r--r-- root/root       625 2018-08-18 01:01 ./usr/share/man/man5/kamailio.cfg.5.gz
drwxr-xr-x root/root         0 2018-08-18 01:01 ./usr/share/man/man7/
drwxr-xr-x root/root         0 2018-08-18 01:01 ./usr/share/man/man8/
-rw-r--r-- root/root      1753 2018-08-18 01:01 ./usr/share/man/man8/kamailio.8.gz
-rw-r--r-- root/root       395 2018-08-18 01:01 ./usr/share/man/man8/kamcmd.8.gz
-rw-r--r-- root/root       536 2018-08-18 01:01 ./usr/share/man/man8/kamctl.8.gz
-rw-r--r-- root/root       653 2018-08-18 01:01 ./usr/share/man/man8/kamdbctl.8.gz
lrwxrwxrwx root/root         0 2018-08-18 01:01 ./usr/lib/x86_64-linux-gnu/kamailio/libsrdb1.so -> libsrdb1.so.1.0
lrwxrwxrwx root/root         0 2018-08-18 01:01 ./usr/lib/x86_64-linux-gnu/kamailio/libsrdb1.so.1 -> libsrdb1.so.1.0
lrwxrwxrwx root/root         0 2018-08-18 01:01 ./usr/lib/x86_64-linux-gnu/kamailio/libsrdb2.so -> libsrdb2.so.1.0
lrwxrwxrwx root/root         0 2018-08-18 01:01 ./usr/lib/x86_64-linux-gnu/kamailio/libsrdb2.so.1 -> libsrdb2.so.1.0
lrwxrwxrwx root/root         0 2018-08-18 01:01 ./usr/lib/x86_64-linux-gnu/kamailio/libsrutils.so -> libsrutils.so.1.0
lrwxrwxrwx root/root         0 2018-08-18 01:01 ./usr/lib/x86_64-linux-gnu/kamailio/libsrutils.so.1 -> libsrutils.so.1.0
lrwxrwxrwx root/root         0 2018-08-18 01:01 ./usr/lib/x86_64-linux-gnu/kamailio/libtrie.so -> libtrie.so.1.0
lrwxrwxrwx root/root         0 2018-08-18 01:01 ./usr/lib/x86_64-linux-gnu/kamailio/libtrie.so.1 -> libtrie.so.1.0

+ bailout 0
+ '[' -n 0 ']'
+ EXIT=0
+ '[' -n '' ']'
+ rm -f /var/run/lock/stretch-amd64.building.24137
+ '[' -r /var/run/lock/stretch-amd64.update.24137 ']'
+ '[' '' = true ']'
+ echo '*** Getting rid of files in <https://kamailio.sipwise.com/job/kamailiodev-nightly-binaries/architecture=amd64,distribution=stretch,label=slave/ws/binaries/> to avoid problems in next run. ***'
*** Getting rid of files in <https://kamailio.sipwise.com/job/kamailiodev-nightly-binaries/architecture=amd64,distribution=stretch,label=slave/ws/binaries/> to avoid problems in next run. ***
+ rm -f '<https://kamailio.sipwise.com/job/kamailiodev-nightly-binaries/architecture=amd64,distribution=stretch,label=slave/ws/binaries/*'>
+ '[' -n /tmp/tmp.7LG4QZUl17 ']'
+ rm -rf /tmp/tmp.7LG4QZUl17
+ '[' -n /tmp/apt-jdg_Y0gIBm ']'
+ sudo rm -rf /tmp/apt-jdg_Y0gIBm
+ '[' -n 6797 ']'
++ sed -e 's/^\([0-9]*\).*/\1/'
+ SECONDS=823
++ date
+ echo '*** Finished execution of /usr/bin/build-and-provide-package at Sat Aug 18 04:29:14 UTC 2018 [running 823 seconds] ***'
*** Finished execution of /usr/bin/build-and-provide-package at Sat Aug 18 04:29:14 UTC 2018 [running 823 seconds] ***
+ exit 0
[slave] $ /bin/sh -xe /tmp/jenkins4400670533572284647.sh
+ mkdir -p report
+ /usr/bin/lintian-junit-report kamailio_5.2.0~dev6+0~20180818005745.1181+stretch_source.changes kamailio_5.2.0~dev6+0~20180818010155.1181+stretch_amd64.changes
<https://kamailio.sipwise.com/job/kamailiodev-nightly-binaries/architecture=amd64,distribution=stretch,label=slave/1166/artifact/kamailio_5.2.0~dev6+0~20180818005745.1181+stretch_source.buildinfo> does not exist, exiting
[slave] $ /bin/sh -xe /tmp/jenkins8450715373085822505.sh
+ mkdir -p report adt
+ touch adt/summary
+ /usr/bin/adtsummary_tap adt/summary
Archiving artifacts
ERROR: Step ‘Archive the artifacts’ aborted due to exception:
java.nio.file.NoSuchFileException: <https://kamailio.sipwise.com/job/kamailiodev-nightly-binaries/architecture=amd64,distribution=stretch,label=slave/1166/artifact/kamailio-nth_5.2.0~dev6+0~20180818010155.1181+stretch_amd64.deb>
        at sun.nio.fs.UnixException.translateToIOException(UnixException.java:86)
        at sun.nio.fs.UnixException.rethrowAsIOException(UnixException.java:102)
        at sun.nio.fs.UnixException.rethrowAsIOException(UnixException.java:107)
        at sun.nio.fs.UnixFileAttributeViews$Posix.readAttributes(UnixFileAttributeViews.java:218)
        at sun.nio.fs.UnixFileAttributeViews$Posix.readAttributes(UnixFileAttributeViews.java:131)
        at sun.nio.fs.UnixFileSystemProvider.readAttributes(UnixFileSystemProvider.java:144)
        at sun.nio.fs.LinuxFileSystemProvider.readAttributes(LinuxFileSystemProvider.java:99)
        at java.nio.file.Files.readAttributes(Files.java:1737)
        at java.nio.file.Files.getPosixFilePermissions(Files.java:2004)
        at hudson.util.IOUtils.mode(IOUtils.java:130)
Also:   hudson.remoting.Channel$CallSiteStackTrace: Remote call to jenkins-debian-glue-slave (i-001c0fdf0e20b7135)
                at hudson.remoting.Channel.attachCallSiteStackTrace(Channel.java:1741)
                at hudson.remoting.UserRequest$ExceptionResponse.retrieve(UserRequest.java:357)
                at hudson.remoting.Channel$2.adapt(Channel.java:990)
                at hudson.remoting.Channel$2.adapt(Channel.java:986)
                at hudson.remoting.FutureAdapter.get(FutureAdapter.java:55)
                at hudson.FilePath.copyRecursiveTo(FilePath.java:2375)
                at jenkins.model.StandardArtifactManager.archive(StandardArtifactManager.java:61)
                at hudson.tasks.ArtifactArchiver.perform(ArtifactArchiver.java:235)
                at hudson.tasks.BuildStepCompatibilityLayer.perform(BuildStepCompatibilityLayer.java:81)
                at hudson.tasks.BuildStepMonitor$1.perform(BuildStepMonitor.java:20)
                at hudson.model.AbstractBuild$AbstractBuildExecution.perform(AbstractBuild.java:744)
                at hudson.model.AbstractBuild$AbstractBuildExecution.performAllBuildSteps(AbstractBuild.java:690)
                at hudson.model.Build$BuildExecution.post2(Build.java:186)
                at hudson.model.AbstractBuild$AbstractBuildExecution.post(AbstractBuild.java:635)
                at hudson.model.Run.execute(Run.java:1823)
                at hudson.matrix.MatrixRun.run(MatrixRun.java:153)
                at hudson.model.ResourceController.execute(ResourceController.java:97)
                at hudson.model.Executor.run(Executor.java:429)
Caused: hudson.os.PosixException: Unable to get file permissions null
        at hudson.util.IOUtils.mode(IOUtils.java:133)
        at hudson.util.io.TarArchiver.visit(TarArchiver.java:92)
        at hudson.util.DirScanner.scanSingle(DirScanner.java:44)
        at hudson.FilePath$ExplicitlySpecifiedDirScanner.scan(FilePath.java:2995)
        at hudson.FilePath.writeToTar(FilePath.java:2432)
        at hudson.FilePath.access$2800(FilePath.java:210)
        at hudson.FilePath$CopyRecursiveRemoteToLocal.invoke(FilePath.java:2397)
        at hudson.FilePath$CopyRecursiveRemoteToLocal.invoke(FilePath.java:2386)
        at hudson.FilePath$FileCallableWrapper.call(FilePath.java:2917)
        at hudson.remoting.UserRequest.perform(UserRequest.java:212)
        at hudson.remoting.UserRequest.perform(UserRequest.java:54)
        at hudson.remoting.Request$2.run(Request.java:369)
        at hudson.remoting.InterceptingExecutorService$1.call(InterceptingExecutorService.java:72)
        at java.util.concurrent.FutureTask.run(FutureTask.java:266)
        at java.util.concurrent.ThreadPoolExecutor.runWorker(ThreadPoolExecutor.java:1149)
        at java.util.concurrent.ThreadPoolExecutor$Worker.run(ThreadPoolExecutor.java:624)
        at java.lang.Thread.run(Thread.java:748)
Caused: java.io.IOException
        at hudson.FilePath.copyRecursiveTo(FilePath.java:2379)
        at jenkins.model.StandardArtifactManager.archive(StandardArtifactManager.java:61)
        at hudson.tasks.ArtifactArchiver.perform(ArtifactArchiver.java:235)
        at hudson.tasks.BuildStepCompatibilityLayer.perform(BuildStepCompatibilityLayer.java:81)
        at hudson.tasks.BuildStepMonitor$1.perform(BuildStepMonitor.java:20)
        at hudson.model.AbstractBuild$AbstractBuildExecution.perform(AbstractBuild.java:744)
        at hudson.model.AbstractBuild$AbstractBuildExecution.performAllBuildSteps(AbstractBuild.java:690)
        at hudson.model.Build$BuildExecution.post2(Build.java:186)
        at hudson.model.AbstractBuild$AbstractBuildExecution.post(AbstractBuild.java:635)
        at hudson.model.Run.execute(Run.java:1823)
        at hudson.matrix.MatrixRun.run(MatrixRun.java:153)
        at hudson.model.ResourceController.execute(ResourceController.java:97)
        at hudson.model.Executor.run(Executor.java:429)
TAP Reports Processing: START
Looking for TAP results report in workspace using pattern: report/*.tap
ERROR: Step ‘Publish TAP Results’ aborted due to exception:
Also:   hudson.remoting.Channel$CallSiteStackTrace: Remote call to jenkins-debian-glue-slave (i-001c0fdf0e20b7135)
                at hudson.remoting.Channel.attachCallSiteStackTrace(Channel.java:1741)
                at hudson.remoting.UserRequest$ExceptionResponse.retrieve(UserRequest.java:357)
                at hudson.remoting.Channel.call(Channel.java:955)
                at hudson.FilePath.act(FilePath.java:1036)
                at hudson.FilePath.act(FilePath.java:1025)
                at hudson.FilePath.list(FilePath.java:1840)
                at hudson.FilePath.list(FilePath.java:1824)
                at hudson.FilePath.list(FilePath.java:1809)
                at org.tap4j.plugin.TapPublisher.locateReports(TapPublisher.java:647)
                at org.tap4j.plugin.TapPublisher.performImpl(TapPublisher.java:383)
                at org.tap4j.plugin.TapPublisher.perform(TapPublisher.java:371)
                at hudson.tasks.BuildStepCompatibilityLayer.perform(BuildStepCompatibilityLayer.java:81)
                at hudson.tasks.BuildStepMonitor$1.perform(BuildStepMonitor.java:20)
                at hudson.model.AbstractBuild$AbstractBuildExecution.perform(AbstractBuild.java:744)
                at hudson.model.AbstractBuild$AbstractBuildExecution.performAllBuildSteps(AbstractBuild.java:690)
                at hudson.model.Build$BuildExecution.post2(Build.java:186)
                at hudson.model.AbstractBuild$AbstractBuildExecution.post(AbstractBuild.java:635)
                at hudson.model.Run.execute(Run.java:1823)
                at hudson.matrix.MatrixRun.run(MatrixRun.java:153)
                at hudson.model.ResourceController.execute(ResourceController.java:97)
                at hudson.model.Executor.run(Executor.java:429)
java.io.IOException: <https://kamailio.sipwise.com/job/kamailiodev-nightly-binaries/architecture=amd64,distribution=stretch,label=slave/ws/> does not exist.
        at hudson.FilePath.glob(FilePath.java:1870)
        at hudson.FilePath.access$2400(FilePath.java:210)
        at hudson.FilePath$23.invoke(FilePath.java:1843)
        at hudson.FilePath$23.invoke(FilePath.java:1840)
        at hudson.FilePath$FileCallableWrapper.call(FilePath.java:2917)
        at hudson.remoting.UserRequest.perform(UserRequest.java:212)
        at hudson.remoting.UserRequest.perform(UserRequest.java:54)
        at hudson.remoting.Request$2.run(Request.java:369)
        at hudson.remoting.InterceptingExecutorService$1.call(InterceptingExecutorService.java:72)
        at java.util.concurrent.FutureTask.run(FutureTask.java:266)
        at java.util.concurrent.ThreadPoolExecutor.runWorker(ThreadPoolExecutor.java:1149)
        at java.util.concurrent.ThreadPoolExecutor$Worker.run(ThreadPoolExecutor.java:624)
        at java.lang.Thread.run(Thread.java:748)
Recording test results
ERROR: Build step failed with exception
Also:   hudson.remoting.Channel$CallSiteStackTrace: Remote call to jenkins-debian-glue-slave (i-001c0fdf0e20b7135)
                at hudson.remoting.Channel.attachCallSiteStackTrace(Channel.java:1741)
                at hudson.remoting.UserRequest$ExceptionResponse.retrieve(UserRequest.java:357)
                at hudson.remoting.Channel.call(Channel.java:955)
                at hudson.FilePath.act(FilePath.java:1036)
                at hudson.FilePath.act(FilePath.java:1025)
                at hudson.tasks.junit.JUnitParser.parseResult(JUnitParser.java:114)
                at hudson.tasks.junit.JUnitResultArchiver.parse(JUnitResultArchiver.java:136)
                at hudson.tasks.junit.JUnitResultArchiver.parseAndAttach(JUnitResultArchiver.java:166)
                at hudson.tasks.junit.JUnitResultArchiver.perform(JUnitResultArchiver.java:153)
                at hudson.tasks.BuildStepCompatibilityLayer.perform(BuildStepCompatibilityLayer.java:81)
                at hudson.tasks.BuildStepMonitor$1.perform(BuildStepMonitor.java:20)
                at hudson.model.AbstractBuild$AbstractBuildExecution.perform(AbstractBuild.java:744)
                at hudson.model.AbstractBuild$AbstractBuildExecution.performAllBuildSteps(AbstractBuild.java:690)
                at hudson.model.Build$BuildExecution.post2(Build.java:186)
                at hudson.model.AbstractBuild$AbstractBuildExecution.post(AbstractBuild.java:635)
                at hudson.model.Run.execute(Run.java:1823)
                at hudson.matrix.MatrixRun.run(MatrixRun.java:153)
                at hudson.model.ResourceController.execute(ResourceController.java:97)
                at hudson.model.Executor.run(Executor.java:429)
<https://kamailio.sipwise.com/job/kamailiodev-nightly-binaries/architecture=amd64,distribution=stretch,label=slave/ws/> does not exist.
        at org.apache.tools.ant.types.AbstractFileSet.getDirectoryScanner(AbstractFileSet.java:484)
        at org.apache.tools.ant.types.AbstractFileSet.getDirectoryScanner(AbstractFileSet.java:461)
        at hudson.tasks.junit.JUnitParser$ParseResultCallable.invoke(JUnitParser.java:141)
        at hudson.tasks.junit.JUnitParser$ParseResultCallable.invoke(JUnitParser.java:118)
        at hudson.FilePath$FileCallableWrapper.call(FilePath.java:2917)
        at hudson.remoting.UserRequest.perform(UserRequest.java:212)
        at hudson.remoting.UserRequest.perform(UserRequest.java:54)
        at hudson.remoting.Request$2.run(Request.java:369)
        at hudson.remoting.InterceptingExecutorService$1.call(InterceptingExecutorService.java:72)
        at java.util.concurrent.FutureTask.run(FutureTask.java:266)
        at java.util.concurrent.ThreadPoolExecutor.runWorker(ThreadPoolExecutor.java:1149)
        at java.util.concurrent.ThreadPoolExecutor$Worker.run(ThreadPoolExecutor.java:624)
        at java.lang.Thread.run(Thread.java:748)
Build step 'Publish JUnit test result report' marked build as failure

_______________________________________________
Kamailio (SER) - Development Mailing List
[hidden email]
https://lists.kamailio.org/cgi-bin/mailman/listinfo/sr-dev
Reply | Threaded
Open this post in threaded view
|

[sr-dev] Build failed in Jenkins: kamailiodev-nightly-binaries » amd64,stretch,slave #1167

jenkins-2
See <https://kamailio.sipwise.com/job/kamailiodev-nightly-binaries/architecture=amd64,distribution=stretch,label=slave/1167/display/redirect>

------------------------------------------
[...truncated 703.76 KB...]
Processing triggers for libc-bin (2.24-11+deb9u3) ...
Setting up libfakeroot:amd64 (1.21-3.1) ...
Processing triggers for man-db (2.7.6.1-2) ...
Not building database; man-db/auto-update is not 'true'.
Setting up fakeroot (1.21-3.1) ...
update-alternatives: using /usr/bin/fakeroot-sysv to provide /usr/bin/fakeroot (fakeroot) in auto mode
Processing triggers for libc-bin (2.24-11+deb9u3) ...
I: Copying back the cached apt archive contents
I: new cache content libjson-c-dev_0.12.1-1.1_amd64.deb added
I: new cache content libphonenumber7_7.1.0-5+b1_amd64.deb added
I: new cache content odbcinst1debian2_2.3.4-1_amd64.deb added
I: new cache content libmariadbclient18_10.1.26-0+deb9u1_amd64.deb added
I: new cache content libicu-dev_57.1-6+deb9u2_amd64.deb added
I: new cache content libmongoc-dev_1.4.2-1+b1_amd64.deb added
I: new cache content libpixman-1-0_0.34.0-1_amd64.deb added
I: new cache content xsltproc_1.1.29-2.1_amd64.deb added
I: new cache content libboost-atomic1.62-dev_1.62.0+dfsg-4_amd64.deb added
I: new cache content python2.7-minimal_2.7.13-2+deb9u2_amd64.deb added
I: new cache content libidn2-0_0.16-1+deb9u1_amd64.deb added
I: new cache content libgtk2.0-0_2.24.31-2_amd64.deb added
I: new cache content libgeoip1_1.6.9-4_amd64.deb added
I: new cache content geoip-bin_1.6.9-4_amd64.deb added
I: new cache content ecj_3.11.1-1_amd64.deb added
I: new cache content default-libmysqlclient-dev_1.0.2_amd64.deb added
I: new cache content libevent-core-2.0-5_2.0.21-stable-3_amd64.deb added
I: new cache content libpython2.7_2.7.13-2+deb9u2_amd64.deb added
I: new cache content libexpat1-dev_2.2.0-2+deb9u1_amd64.deb added
I: new cache content libwrap0_7.6.q-26_amd64.deb added
I: new cache content libxinerama1_2%3a1.1.3-1+b3_amd64.deb added
I: new cache content icu-devtools_57.1-6+deb9u2_amd64.deb added
I: new cache content libsigsegv2_2.10-5_amd64.deb added
I: new cache content libevent-pthreads-2.0-5_2.0.21-stable-3_amd64.deb added
I: new cache content libxcomposite1_1%3a0.4.4-2_amd64.deb added
I: new cache content libsasl2-modules-db_2.1.27~101-g0780600+dfsg-3_amd64.deb added
I: new cache content libpsl5_0.17.0-3_amd64.deb added
I: new cache content python2.7_2.7.13-2+deb9u2_amd64.deb added
I: new cache content erlang-dev_1%3a19.2.1+dfsg-2+deb9u1_amd64.deb added
I: new cache content libdbus-1-3_1.10.26-0+deb9u1_amd64.deb added
I: new cache content libbson-1.0-0_1.4.2-1_amd64.deb added
I: new cache content python2.7-dev_2.7.13-2+deb9u2_amd64.deb added
I: new cache content libxml2-dev_2.9.4+dfsg1-2.2+deb9u2_amd64.deb added
I: new cache content odbcinst_2.3.4-1_amd64.deb added
I: new cache content libboost-chrono1.62.0_1.62.0+dfsg-4_amd64.deb added
I: new cache content erlang-base_1%3a19.2.1+dfsg-2+deb9u1_amd64.deb added
I: new cache content libfakeroot_1.21-3.1_amd64.deb added
I: new cache content libtiff5_4.0.8-2+deb9u2_amd64.deb added
I: new cache content libxfixes3_1%3a5.0.3-1_amd64.deb added
I: new cache content libpcrecpp0v5_2%3a8.39-3_amd64.deb added
I: new cache content python-minimal_2.7.13-2_amd64.deb added
I: new cache content libboost-date-time1.62-dev_1.62.0+dfsg-4_amd64.deb added
I: new cache content libxcb-shm0_1.12-1_amd64.deb added
I: new cache content libboost-serialization1.62.0_1.62.0+dfsg-4_amd64.deb added
I: new cache content libncurses5-dev_6.0+20161126-1+deb9u2_amd64.deb added
I: new cache content libice6_2%3a1.0.9-2_amd64.deb added
I: new cache content libperl-dev_5.24.1-3+deb9u4_amd64.deb added
I: new cache content libjson-c3_0.12.1-1.1_amd64.deb added
I: new cache content libfreetype6_2.6.3-3.2_amd64.deb added
I: new cache content libboost-chrono1.62-dev_1.62.0+dfsg-4_amd64.deb added
I: new cache content libavahi-client3_0.6.32-2_amd64.deb added
I: new cache content libgeocoding7_7.1.0-5+b1_amd64.deb added
I: new cache content libjpeg62-turbo_1%3a1.5.1-2_amd64.deb added
I: new cache content libwrap0-dev_7.6.q-26_amd64.deb added
I: new cache content libglib2.0-0_2.50.3-2_amd64.deb added
I: new cache content libharfbuzz0b_1.4.2-1_amd64.deb added
I: new cache content libcurl3_7.52.1-5+deb9u6_amd64.deb added
I: new cache content libnghttp2-14_1.18.1-1_amd64.deb added
I: new cache content libpng16-16_1.6.28-1_amd64.deb added
I: new cache content libjansson-dev_2.9-1_amd64.deb added
I: new cache content libjansson4_2.9-1_amd64.deb added
I: new cache content libboost1.62-dev_1.62.0+dfsg-4_amd64.deb added
I: new cache content libpython-dev_2.7.13-2_amd64.deb added
I: new cache content libboost-serialization1.62-dev_1.62.0+dfsg-4_amd64.deb added
I: new cache content libgcj-bc_6.3.0-4_amd64.deb added
I: new cache content libsqlite3-dev_3.16.2-5+deb9u1_amd64.deb added
I: new cache content gettext_0.19.8.1-2_amd64.deb added
I: new cache content flex_2.6.1-1.3_amd64.deb added
I: new cache content libpython2.7-dev_2.7.13-2+deb9u2_amd64.deb added
I: new cache content libprocps6_2%3a3.3.12-3+deb9u1_amd64.deb added
I: new cache content libsnmp-dev_5.7.3+dfsg-1.7_amd64.deb added
I: new cache content libgssapi-krb5-2_1.15-1+deb9u1_amd64.deb added
I: new cache content libpython2.7-minimal_2.7.13-2+deb9u2_amd64.deb added
I: new cache content file_1%3a5.30-1+deb9u2_amd64.deb added
I: new cache content libsctp-dev_1.0.17+dfsg-1+b1_amd64.deb added
I: new cache content libboost-thread1.62.0_1.62.0+dfsg-4_amd64.deb added
I: new cache content libk5crypto3_1.15-1+deb9u1_amd64.deb added
I: new cache content uuid-dev_2.29.2-1+deb9u1_amd64.deb added
I: new cache content libkrb5support0_1.15-1+deb9u1_amd64.deb added
I: new cache content openssl_1.1.0f-3+deb9u2_amd64.deb added
I: new cache content fastjar_2%3a0.98-6+b1_amd64.deb added
I: new cache content libboost-system1.62-dev_1.62.0+dfsg-4_amd64.deb added
I: new cache content libxrandr2_2%3a1.5.1-1_amd64.deb added
I: new cache content libgraphite2-3_1.3.10-1_amd64.deb added
I: new cache content groff-base_1.22.3-9_amd64.deb added
I: new cache content libnettle6_3.3-1+b2_amd64.deb added
I: new cache content libavahi-common-data_0.6.32-2_amd64.deb added
I: new cache content gcj-6_6.3.0-18+deb9u1_amd64.deb added
I: new cache content libxcursor1_1%3a1.1.14-1+deb9u1_amd64.deb added
I: new cache content libxcb-render0_1.12-1_amd64.deb added
I: new cache content gcj-jre_4%3a6.3.0-4_amd64.deb added
I: new cache content librtmp1_2.4+20151223.gitfa8646d.1-1+b1_amd64.deb added
I: new cache content libxslt1.1_1.1.29-2.1_amd64.deb added
I: new cache content libxcb1_1.12-1_amd64.deb added
I: new cache content gcj-jre-headless_4%3a6.3.0-4_amd64.deb added
I: new cache content libevent-2.0-5_2.0.21-stable-3_amd64.deb added
I: new cache content libavahi-common3_0.6.32-2_amd64.deb added
I: new cache content libbsd0_0.8.3-1_amd64.deb added
I: new cache content libprotobuf10_3.0.0-9_amd64.deb added
I: new cache content libpcre32-3_2%3a8.39-3_amd64.deb added
I: new cache content libxdmcp6_1%3a1.1.2-3_amd64.deb added
I: new cache content libmagic-mgc_1%3a5.30-1+deb9u2_amd64.deb added
I: new cache content libssl-dev_1.1.0f-3+deb9u2_amd64.deb added
I: new cache content man-db_2.7.6.1-2_amd64.deb added
I: new cache content procps_2%3a3.3.12-3+deb9u1_amd64.deb added
I: new cache content libtasn1-6_4.10-1.1+deb9u1_amd64.deb added
I: new cache content libmariadbclient-dev-compat_10.1.26-0+deb9u1_amd64.deb added
I: new cache content python_2.7.13-2_amd64.deb added
I: new cache content libboost-date-time1.62.0_1.62.0+dfsg-4_amd64.deb added
I: new cache content libunistring0_0.9.6+really0.9.3-0.1_amd64.deb added
I: new cache content libkrb5-3_1.15-1+deb9u1_amd64.deb added
I: new cache content libmaxminddb0_1.2.0-1+b1_amd64.deb added
I: new cache content libyajl2_2.1.0-2+b3_amd64.deb added
I: new cache content libjbig0_2.1-3.1+b2_amd64.deb added
I: new cache content libcroco3_0.6.11-3_amd64.deb added
I: new cache content gcj-6-jre-headless_6.3.0-18+deb9u1_amd64.deb added
I: new cache content libxrender1_1%3a0.9.10-1_amd64.deb added
I: new cache content libpq5_9.6.9-0+deb9u1_amd64.deb added
I: new cache content gcj-6-jre_6.3.0-18+deb9u1_amd64.deb added
I: new cache content libssl1.1_1.1.0f-3+deb9u2_amd64.deb added
I: new cache content libevent-extra-2.0-5_2.0.21-stable-3_amd64.deb added
I: new cache content libudev-dev_232-25+deb9u4_amd64.deb added
I: new cache content libunistring-dev_0.9.6+really0.9.3-0.1_amd64.deb added
I: new cache content zlib1g-dev_1%3a1.2.8.dfsg-5_amd64.deb added
I: new cache content libgcj17-dev_6.3.0-18+deb9u1_amd64.deb added
I: new cache content libpangocairo-1.0-0_1.40.5-1_amd64.deb added
I: new cache content libcurl4-openssl-dev_7.52.1-5+deb9u6_amd64.deb added
I: new cache content libxdamage1_1%3a1.1.4-2+b3_amd64.deb added
I: new cache content libldap-2.4-2_2.4.44+dfsg-5+deb9u2_amd64.deb added
I: new cache content libasound2_1.1.3-5_amd64.deb added
I: new cache content libgcj17_6.3.0-18+deb9u1_amd64.deb added
I: new cache content libsasl2-dev_2.1.27~101-g0780600+dfsg-3_amd64.deb added
I: new cache content ecj1_3.11.1-1_amd64.deb added
I: new cache content gcj-6-jdk_6.3.0-18+deb9u1_amd64.deb added
I: new cache content libdb5.3-dev_5.3.28-12+deb9u1_amd64.deb added
I: new cache content gettext-base_0.19.8.1-2_amd64.deb added
I: new cache content libldap2-dev_2.4.44+dfsg-5+deb9u2_amd64.deb added
I: new cache content bsdmainutils_9.0.12+nmu1_amd64.deb added
I: new cache content libpango-1.0-0_1.40.5-1_amd64.deb added
I: new cache content libcairo2_1.14.8-1_amd64.deb added
I: new cache content libsasl2-2_2.1.27~101-g0780600+dfsg-3_amd64.deb added
I: new cache content libtinfo-dev_6.0+20161126-1+deb9u2_amd64.deb added
I: new cache content libgcj17-awt_6.3.0-18+deb9u1_amd64.deb added
I: new cache content libfontconfig1_2.11.0-6.7+b1_amd64.deb added
I: new cache content shared-mime-info_1.8-1+deb9u1_amd64.deb added
I: new cache content libkeyutils1_1.5.9-9_amd64.deb added
I: new cache content libx11-6_2%3a1.6.4-3_amd64.deb added
I: new cache content libp11-kit0_0.23.3-2_amd64.deb added
I: new cache content libecj-java-gcj_3.11.1-1_amd64.deb added
I: new cache content libpq-dev_9.6.9-0+deb9u1_amd64.deb added
I: new cache content libpcre16-3_2%3a8.39-3_amd64.deb added
I: new cache content libatk1.0-0_2.22.0-1_amd64.deb added
I: new cache content libxtst6_2%3a1.2.3-1_amd64.deb added
I: new cache content libsnmp30_5.7.3+dfsg-1.7_amd64.deb added
I: new cache content ecj-gcj_3.11.1-1_amd64.deb added
I: new cache content libpython-stdlib_2.7.13-2_amd64.deb added
I: new cache content libprotobuf-lite10_3.0.0-9_amd64.deb added
I: new cache content libpangoft2-1.0-0_1.40.5-1_amd64.deb added
I: new cache content libodbc1_2.3.4-1_amd64.deb added
I: new cache content libhogweed4_3.3-1+b2_amd64.deb added
I: new cache content libevent-dev_2.0.21-stable-3_amd64.deb added
I: new cache content libsctp1_1.0.17+dfsg-1+b1_amd64.deb added
I: new cache content fakeroot_1.21-3.1_amd64.deb added
I: new cache content libxi6_2%3a1.7.9-1_amd64.deb added
I: new cache content libboost-atomic1.62.0_1.62.0+dfsg-4_amd64.deb added
I: new cache content python-dev_2.7.13-2_amd64.deb added
I: new cache content libphonenumber-dev_7.1.0-5+b1_amd64.deb added
I: new cache content gcj-jdk_4%3a6.3.0-4_amd64.deb added
I: new cache content libicu57_57.1-6+deb9u2_amd64.deb added
I: new cache content libssh2-1_1.7.0-1_amd64.deb added
I: new cache content libbson-dev_1.4.2-1_amd64.deb added
I: new cache content libmaxminddb-dev_1.2.0-1+b1_amd64.deb added
I: new cache content libgdk-pixbuf2.0-0_2.36.5-2+deb9u2_amd64.deb added
I: new cache content libthai0_0.1.26-1_amd64.deb added
I: new cache content libmariadbclient-dev_10.1.26-0+deb9u1_amd64.deb added
I: new cache content libgnutls30_3.5.8-5+deb9u3_amd64.deb added
I: new cache content libxml2_2.9.4+dfsg1-2.2+deb9u2_amd64.deb added
I: new cache content libcups2_2.2.1-8+deb9u1_amd64.deb added
I: new cache content libdatrie1_0.2.10-4+b1_amd64.deb added
I: new cache content unixodbc-dev_2.3.4-1_amd64.deb added
I: new cache content gtk-update-icon-cache_3.22.11-1_amd64.deb added
I: new cache content librsvg2-common_2.40.16-1+b1_amd64.deb added
I: new cache content libmongoc-1.0-0_1.4.2-1+b1_amd64.deb added
I: new cache content libexpat1_2.2.0-2+deb9u1_amd64.deb added
I: new cache content libsm6_2%3a1.2.2-1+b3_amd64.deb added
I: new cache content libssl1.0.2_1.0.2l-2+deb9u3_amd64.deb added
I: new cache content librsvg2-2_2.40.16-1+b1_amd64.deb added
I: new cache content libpcre3-dev_2%3a8.39-3_amd64.deb added
I: new cache content libidn11_1.33-1_amd64.deb added
I: new cache content libpython2.7-stdlib_2.7.13-2+deb9u2_amd64.deb added
I: new cache content libxext6_2%3a1.3.3-1+b2_amd64.deb added
I: new cache content libsystemd-dev_232-25+deb9u4_amd64.deb added
I: new cache content libgeoip-dev_1.6.9-4_amd64.deb added
I: new cache content libevent-openssl-2.0-5_2.0.21-stable-3_amd64.deb added
I: new cache content libprotobuf-dev_3.0.0-9_amd64.deb added
I: new cache content libboost-thread1.62-dev_1.62.0+dfsg-4_amd64.deb added
I: new cache content libmagic1_1%3a5.30-1+deb9u2_amd64.deb added
I: new cache content libffi6_3.2.1-6_amd64.deb added
I: new cache content fontconfig_2.11.0-6.7+b1_amd64.deb added
I: Copying source file
cat: <https://kamailio.sipwise.com/job/kamailiodev-nightly-binaries/architecture=amd64,distribution=stretch,label=slave/1167/artifact/kamailio_5.2.0~dev6+0~20180819010154.1182+stretch.dsc>: No such file or directory
I: copying [<https://kamailio.sipwise.com/job/kamailiodev-nightly-binaries/architecture=amd64,distribution=stretch,label=slave/ws/kamailio_5.2.0~dev6+0~20180819010154.1182+stretch.dsc]>
cp: cannot stat '<https://kamailio.sipwise.com/job/kamailiodev-nightly-binaries/architecture=amd64,distribution=stretch,label=slave/ws/kamailio_5.2.0~dev6+0~20180819010154.1182+stretch.dsc'>: No such file or directory
I: unmounting /tmp/apt-jdg_lMYrbz filesystem
I: unmounting dev/pts filesystem
I: unmounting run/shm filesystem
I: unmounting proc filesystem
 -> Cleaning COW directory
  forking: rm -rf /var/cache/pbuilder/build//cow.32338
+ '[' 1 -eq 0 ']'
+ bailout 1 'Error: Failed to build with cowbuilder.'
+ '[' -n 1 ']'
+ EXIT=1
+ '[' -n 'Error: Failed to build with cowbuilder.' ']'
+ echo 'Error: Failed to build with cowbuilder.'
Error: Failed to build with cowbuilder.
+ rm -f /var/run/lock/stretch-amd64.building.25628
+ '[' -r /var/run/lock/stretch-amd64.update.25628 ']'
+ '[' '' = true ']'
+ echo '*** Getting rid of files in <https://kamailio.sipwise.com/job/kamailiodev-nightly-binaries/architecture=amd64,distribution=stretch,label=slave/ws/binaries/> to avoid problems in next run. ***'
*** Getting rid of files in <https://kamailio.sipwise.com/job/kamailiodev-nightly-binaries/architecture=amd64,distribution=stretch,label=slave/ws/binaries/> to avoid problems in next run. ***
+ rm -f '<https://kamailio.sipwise.com/job/kamailiodev-nightly-binaries/architecture=amd64,distribution=stretch,label=slave/ws/binaries/*'>
+ '[' -n /tmp/tmp.APXFqvpDkc ']'
+ rm -rf /tmp/tmp.APXFqvpDkc
+ '[' -n /tmp/apt-jdg_lMYrbz ']'
+ sudo rm -rf /tmp/apt-jdg_lMYrbz
+ '[' -n 11092 ']'
++ sed -e 's/^\([0-9]*\).*/\1/'
+ SECONDS=98
++ date
+ echo '*** Finished execution of /usr/bin/build-and-provide-package at Sun Aug 19 04:05:36 UTC 2018 [running 98 seconds] ***'
*** Finished execution of /usr/bin/build-and-provide-package at Sun Aug 19 04:05:36 UTC 2018 [running 98 seconds] ***
+ exit 1
Build step 'Execute shell' marked build as failure
Archiving artifacts
Recording fingerprints
TAP Reports Processing: START
Looking for TAP results report in workspace using pattern: report/*.tap
Did not find any matching files.
Recording test results
ERROR: Step ‘Publish JUnit test result report’ failed: No test report files were found. Configuration error?

_______________________________________________
Kamailio (SER) - Development Mailing List
[hidden email]
https://lists.kamailio.org/cgi-bin/mailman/listinfo/sr-dev
Reply | Threaded
Open this post in threaded view
|

[sr-dev] Jenkins build is back to normal : kamailiodev-nightly-binaries » amd64,stretch,slave #1168

jenkins-2