[sr-dev] Build failed in Jenkins: kamailiodev-nightly-binaries » i386,xenial,slave #1166

classic Classic list List threaded Threaded
3 messages Options
Reply | Threaded
Open this post in threaded view
|

[sr-dev] Build failed in Jenkins: kamailiodev-nightly-binaries » i386,xenial,slave #1166

jenkins-2
See <https://kamailio.sipwise.com/job/kamailiodev-nightly-binaries/architecture=i386,distribution=xenial,label=slave/1166/display/redirect>

------------------------------------------
[...truncated 640.66 KB...]
CC (gcc) [kamailio] core/parser/parse_param.o
CC (gcc) [kamailio] core/parser/parser_f.o
CC (gcc) [kamailio] core/parser/parse_subscription_state.o
CC (gcc) [kamailio] core/parser/parse_retry_after.o
CC (gcc) [kamailio] core/parser/parse_addr_spec.o
CC (gcc) [kamailio] core/parser/parse_rr.o
CC (gcc) [kamailio] core/parser/parse_allow.o
CC (gcc) [kamailio] core/parser/parse_diversion.o
CC (gcc) [kamailio] core/parser/parse_cseq.o
CC (gcc) [kamailio] core/parser/parse_content.o
CC (gcc) [kamailio] core/parser/parse_event.o
CC (gcc) [kamailio] core/parser/parse_uri.o
CC (gcc) [kamailio] core/parser/parse_disposition.o
CC (gcc) [kamailio] core/parser/parse_methods.o
CC (gcc) [kamailio] core/parser/parse_sipifmatch.o
CC (gcc) [kamailio] core/parser/parse_nameaddr.o
CC (gcc) [kamailio] core/parser/parse_body.o
CC (gcc) [kamailio] core/parser/hf.o
CC (gcc) [kamailio] core/parser/parse_via.o
CC (gcc) [kamailio] core/parser/parse_hname2.o
CC (gcc) [kamailio] core/parser/parse_supported.o
CC (gcc) [kamailio] core/parser/parse_rpid.o
CC (gcc) [kamailio] core/parser/parse_privacy.o
CC (gcc) [kamailio] core/parser/parse_identity.o
CC (gcc) [kamailio] core/parser/parse_option_tags.o
CC (gcc) [kamailio] core/parser/parse_fline.o
CC (gcc) [kamailio] core/parser/parse_hostport.o
CC (gcc) [kamailio] core/parser/parse_date.o
CC (gcc) [kamailio] core/parser/parse_require.o
CC (gcc) [kamailio] core/parser/parse_to.o
CC (gcc) [kamailio] core/parser/parse_ppi_pai.o
CC (gcc) [kamailio] core/parser/parse_identityinfo.o
CC (gcc) [kamailio] core/parser/parse_refer_to.o
CC (gcc) [kamailio] core/parser/parse_expires.o
CC (gcc) [kamailio] core/parser/msg_parser.o
CC (gcc) [kamailio] core/parser/digest/param_parser.o
CC (gcc) [kamailio] core/parser/digest/digest_parser.o
CC (gcc) [kamailio] core/parser/digest/digest.o
CC (gcc) [kamailio] core/parser/contact/contact.o
CC (gcc) [kamailio] core/parser/contact/parse_contact.o
CC (gcc) [kamailio] core/parser/sdp/sdp.o
CC (gcc) [kamailio] core/parser/sdp/sdp_helpr_funcs.o
CC (gcc) [kamailio] core/rand/fastrand.o
CC (gcc) [kamailio] core/rand/isaac/rand.o
CC (gcc) [kamailio] core/cfg/cfg_select.o
CC (gcc) [kamailio] core/cfg/cfg_ctx.o
CC (gcc) [kamailio] core/cfg/cfg_struct.o
CC (gcc) [kamailio] core/cfg/cfg_script.o
CC (gcc) [kamailio] core/cfg/cfg.o
bison -d -b core/cfg core/cfg.y
flex -o core/lex.yy.c core/cfg.lex
CC (gcc) [kamailio] core/lex.yy.o
CC (gcc) [kamailio] core/cfg.tab.o
LD (gcc) [kamailio] kamailio
CC (gcc) [M async.so] async_sleep.o
CC (gcc) [M async.so] async_mod.o
LD (gcc) [M async.so] async.so
CC (gcc) [M auth.so] rfc2617.o
CC (gcc) [M auth.so] nid.o
CC (gcc) [M auth.so] rfc2617_sha256.o
CC (gcc) [M auth.so] nc.o
CC (gcc) [M auth.so] api.o
CC (gcc) [M auth.so] auth_mod.o
CC (gcc) [M auth.so] nonce.o
CC (gcc) [M auth.so] ot_nonce.o
CC (gcc) [M auth.so] challenge.o
CC (gcc) [L libsrutils.so.1.0] shautils.o
CC (gcc) [L libsrutils.so.1.0] sruid.o
CC (gcc) [L libsrutils.so.1.0] srjson.o
CC (gcc) [L libsrutils.so.1.0] sha256.o
CC (gcc) [L libsrutils.so.1.0] tmrec.o
LD (gcc) [L libsrutils.so.1.0] libsrutils.so.1.0
LD (gcc) [M auth.so] auth.so
CC (gcc) [M benchmark.so] benchmark.o
LD (gcc) [M benchmark.so] benchmark.so
CC (gcc) [M blst.so] blst.o
LD (gcc) [M blst.so] blst.so
CC (gcc) [M cfg_rpc.so] cfg_rpc.o
LD (gcc) [M cfg_rpc.so] cfg_rpc.so
CC (gcc) [M cfgutils.so] cfgutils.o
LD (gcc) [M cfgutils.so] cfgutils.so
CC (gcc) [M corex.so] corex_var.o
CC (gcc) [M corex.so] corex_lib.o
CC (gcc) [M corex.so] corex_nio.o
CC (gcc) [M corex.so] corex_mod.o
CC (gcc) [M corex.so] corex_rpc.o
LD (gcc) [M corex.so] corex.so
CC (gcc) [M counters.so] counters.o
LD (gcc) [M counters.so] counters.so
CC (gcc) [M ctl.so] binrpc.o
CC (gcc) [M ctl.so] fifo_server.o
CC (gcc) [M ctl.so] io_listener.o
CC (gcc) [M ctl.so] binrpc_run.o
CC (gcc) [M ctl.so] init_socks.o
CC (gcc) [M ctl.so] ctrl_socks.o
CC (gcc) [M ctl.so] ctl.o
LD (gcc) [M ctl.so] ctl.so
CC (gcc) [M debugger.so] debugger_json.o
CC (gcc) [M debugger.so] debugger_api.o
CC (gcc) [M debugger.so] debugger_config.o
CC (gcc) [M debugger.so] debugger_act.o
CC (gcc) [M debugger.so] debugger_mod.o
make[4]: 'libsrutils.so.1.0' is up to date.
LD (gcc) [M debugger.so] debugger.so
CC (gcc) [M diversion.so] diversion.o
LD (gcc) [M diversion.so] diversion.so
CC (gcc) [M enum.so] enum.o
CC (gcc) [M enum.so] enum_mod.o
Build step 'Execute shell' marked build as failure
Archiving artifacts
ERROR: Step ‘Archive the artifacts’ aborted due to exception:
java.nio.file.NoSuchFileException: <https://kamailio.sipwise.com/job/kamailiodev-nightly-binaries/architecture=i386,distribution=xenial,label=slave/1166/artifact/kamailio-nth_5.2.0~dev6+0~20180818005906.1181+xenial_i386.deb>
        at sun.nio.fs.UnixException.translateToIOException(UnixException.java:86)
        at sun.nio.fs.UnixException.rethrowAsIOException(UnixException.java:102)
        at sun.nio.fs.UnixException.rethrowAsIOException(UnixException.java:107)
        at sun.nio.fs.UnixFileAttributeViews$Posix.readAttributes(UnixFileAttributeViews.java:218)
        at sun.nio.fs.UnixFileAttributeViews$Posix.readAttributes(UnixFileAttributeViews.java:131)
        at sun.nio.fs.UnixFileSystemProvider.readAttributes(UnixFileSystemProvider.java:144)
        at sun.nio.fs.LinuxFileSystemProvider.readAttributes(LinuxFileSystemProvider.java:99)
        at java.nio.file.Files.readAttributes(Files.java:1737)
        at java.nio.file.Files.getPosixFilePermissions(Files.java:2004)
        at hudson.util.IOUtils.mode(IOUtils.java:130)
Also:   hudson.remoting.Channel$CallSiteStackTrace: Remote call to jenkins-debian-glue-slave (i-098d9e2880d77bd0d)
                at hudson.remoting.Channel.attachCallSiteStackTrace(Channel.java:1741)
                at hudson.remoting.UserRequest$ExceptionResponse.retrieve(UserRequest.java:357)
                at hudson.remoting.Channel$2.adapt(Channel.java:990)
                at hudson.remoting.Channel$2.adapt(Channel.java:986)
                at hudson.remoting.FutureAdapter.get(FutureAdapter.java:55)
                at hudson.FilePath.copyRecursiveTo(FilePath.java:2375)
                at jenkins.model.StandardArtifactManager.archive(StandardArtifactManager.java:61)
                at hudson.tasks.ArtifactArchiver.perform(ArtifactArchiver.java:235)
                at hudson.tasks.BuildStepCompatibilityLayer.perform(BuildStepCompatibilityLayer.java:81)
                at hudson.tasks.BuildStepMonitor$1.perform(BuildStepMonitor.java:20)
                at hudson.model.AbstractBuild$AbstractBuildExecution.perform(AbstractBuild.java:744)
                at hudson.model.AbstractBuild$AbstractBuildExecution.performAllBuildSteps(AbstractBuild.java:690)
                at hudson.model.Build$BuildExecution.post2(Build.java:186)
                at hudson.model.AbstractBuild$AbstractBuildExecution.post(AbstractBuild.java:635)
                at hudson.model.Run.execute(Run.java:1823)
                at hudson.matrix.MatrixRun.run(MatrixRun.java:153)
                at hudson.model.ResourceController.execute(ResourceController.java:97)
                at hudson.model.Executor.run(Executor.java:429)
Caused: hudson.os.PosixException: Unable to get file permissions null
        at hudson.util.IOUtils.mode(IOUtils.java:133)
        at hudson.util.io.TarArchiver.visit(TarArchiver.java:92)
        at hudson.util.DirScanner.scanSingle(DirScanner.java:44)
        at hudson.FilePath$ExplicitlySpecifiedDirScanner.scan(FilePath.java:2995)
        at hudson.FilePath.writeToTar(FilePath.java:2432)
        at hudson.FilePath.access$2800(FilePath.java:210)
        at hudson.FilePath$CopyRecursiveRemoteToLocal.invoke(FilePath.java:2397)
        at hudson.FilePath$CopyRecursiveRemoteToLocal.invoke(FilePath.java:2386)
        at hudson.FilePath$FileCallableWrapper.call(FilePath.java:2917)
        at hudson.remoting.UserRequest.perform(UserRequest.java:212)
        at hudson.remoting.UserRequest.perform(UserRequest.java:54)
        at hudson.remoting.Request$2.run(Request.java:369)
        at hudson.remoting.InterceptingExecutorService$1.call(InterceptingExecutorService.java:72)
        at java.util.concurrent.FutureTask.run(FutureTask.java:266)
        at java.util.concurrent.ThreadPoolExecutor.runWorker(ThreadPoolExecutor.java:1149)
        at java.util.concurrent.ThreadPoolExecutor$Worker.run(ThreadPoolExecutor.java:624)
        at java.lang.Thread.run(Thread.java:748)
Caused: java.io.IOException
        at hudson.FilePath.copyRecursiveTo(FilePath.java:2379)
        at jenkins.model.StandardArtifactManager.archive(StandardArtifactManager.java:61)
        at hudson.tasks.ArtifactArchiver.perform(ArtifactArchiver.java:235)
        at hudson.tasks.BuildStepCompatibilityLayer.perform(BuildStepCompatibilityLayer.java:81)
        at hudson.tasks.BuildStepMonitor$1.perform(BuildStepMonitor.java:20)
        at hudson.model.AbstractBuild$AbstractBuildExecution.perform(AbstractBuild.java:744)
        at hudson.model.AbstractBuild$AbstractBuildExecution.performAllBuildSteps(AbstractBuild.java:690)
        at hudson.model.Build$BuildExecution.post2(Build.java:186)
        at hudson.model.AbstractBuild$AbstractBuildExecution.post(AbstractBuild.java:635)
        at hudson.model.Run.execute(Run.java:1823)
        at hudson.matrix.MatrixRun.run(MatrixRun.java:153)
        at hudson.model.ResourceController.execute(ResourceController.java:97)
        at hudson.model.Executor.run(Executor.java:429)
TAP Reports Processing: START
Looking for TAP results report in workspace using pattern: report/*.tap
ERROR: Step ‘Publish TAP Results’ aborted due to exception:
Also:   hudson.remoting.Channel$CallSiteStackTrace: Remote call to jenkins-debian-glue-slave (i-098d9e2880d77bd0d)
                at hudson.remoting.Channel.attachCallSiteStackTrace(Channel.java:1741)
                at hudson.remoting.UserRequest$ExceptionResponse.retrieve(UserRequest.java:357)
                at hudson.remoting.Channel.call(Channel.java:955)
                at hudson.FilePath.act(FilePath.java:1036)
                at hudson.FilePath.act(FilePath.java:1025)
                at hudson.FilePath.list(FilePath.java:1840)
                at hudson.FilePath.list(FilePath.java:1824)
                at hudson.FilePath.list(FilePath.java:1809)
                at org.tap4j.plugin.TapPublisher.locateReports(TapPublisher.java:647)
                at org.tap4j.plugin.TapPublisher.performImpl(TapPublisher.java:383)
                at org.tap4j.plugin.TapPublisher.perform(TapPublisher.java:371)
                at hudson.tasks.BuildStepCompatibilityLayer.perform(BuildStepCompatibilityLayer.java:81)
                at hudson.tasks.BuildStepMonitor$1.perform(BuildStepMonitor.java:20)
                at hudson.model.AbstractBuild$AbstractBuildExecution.perform(AbstractBuild.java:744)
                at hudson.model.AbstractBuild$AbstractBuildExecution.performAllBuildSteps(AbstractBuild.java:690)
                at hudson.model.Build$BuildExecution.post2(Build.java:186)
                at hudson.model.AbstractBuild$AbstractBuildExecution.post(AbstractBuild.java:635)
                at hudson.model.Run.execute(Run.java:1823)
                at hudson.matrix.MatrixRun.run(MatrixRun.java:153)
                at hudson.model.ResourceController.execute(ResourceController.java:97)
                at hudson.model.Executor.run(Executor.java:429)
java.io.IOException: <https://kamailio.sipwise.com/job/kamailiodev-nightly-binaries/architecture=i386,distribution=xenial,label=slave/ws/> does not exist.
        at hudson.FilePath.glob(FilePath.java:1870)
        at hudson.FilePath.access$2400(FilePath.java:210)
        at hudson.FilePath$23.invoke(FilePath.java:1843)
        at hudson.FilePath$23.invoke(FilePath.java:1840)
        at hudson.FilePath$FileCallableWrapper.call(FilePath.java:2917)
        at hudson.remoting.UserRequest.perform(UserRequest.java:212)
        at hudson.remoting.UserRequest.perform(UserRequest.java:54)
        at hudson.remoting.Request$2.run(Request.java:369)
        at hudson.remoting.InterceptingExecutorService$1.call(InterceptingExecutorService.java:72)
        at java.util.concurrent.FutureTask.run(FutureTask.java:266)
        at java.util.concurrent.ThreadPoolExecutor.runWorker(ThreadPoolExecutor.java:1149)
        at java.util.concurrent.ThreadPoolExecutor$Worker.run(ThreadPoolExecutor.java:624)
        at java.lang.Thread.run(Thread.java:748)
Recording test results
ERROR: Build step failed with exception
Also:   hudson.remoting.Channel$CallSiteStackTrace: Remote call to jenkins-debian-glue-slave (i-098d9e2880d77bd0d)
                at hudson.remoting.Channel.attachCallSiteStackTrace(Channel.java:1741)
                at hudson.remoting.UserRequest$ExceptionResponse.retrieve(UserRequest.java:357)
                at hudson.remoting.Channel.call(Channel.java:955)
                at hudson.FilePath.act(FilePath.java:1036)
                at hudson.FilePath.act(FilePath.java:1025)
                at hudson.tasks.junit.JUnitParser.parseResult(JUnitParser.java:114)
                at hudson.tasks.junit.JUnitResultArchiver.parse(JUnitResultArchiver.java:136)
                at hudson.tasks.junit.JUnitResultArchiver.parseAndAttach(JUnitResultArchiver.java:166)
                at hudson.tasks.junit.JUnitResultArchiver.perform(JUnitResultArchiver.java:153)
                at hudson.tasks.BuildStepCompatibilityLayer.perform(BuildStepCompatibilityLayer.java:81)
                at hudson.tasks.BuildStepMonitor$1.perform(BuildStepMonitor.java:20)
                at hudson.model.AbstractBuild$AbstractBuildExecution.perform(AbstractBuild.java:744)
                at hudson.model.AbstractBuild$AbstractBuildExecution.performAllBuildSteps(AbstractBuild.java:690)
                at hudson.model.Build$BuildExecution.post2(Build.java:186)
                at hudson.model.AbstractBuild$AbstractBuildExecution.post(AbstractBuild.java:635)
                at hudson.model.Run.execute(Run.java:1823)
                at hudson.matrix.MatrixRun.run(MatrixRun.java:153)
                at hudson.model.ResourceController.execute(ResourceController.java:97)
                at hudson.model.Executor.run(Executor.java:429)
<https://kamailio.sipwise.com/job/kamailiodev-nightly-binaries/architecture=i386,distribution=xenial,label=slave/ws/> does not exist.
        at org.apache.tools.ant.types.AbstractFileSet.getDirectoryScanner(AbstractFileSet.java:484)
        at org.apache.tools.ant.types.AbstractFileSet.getDirectoryScanner(AbstractFileSet.java:461)
        at hudson.tasks.junit.JUnitParser$ParseResultCallable.invoke(JUnitParser.java:141)
        at hudson.tasks.junit.JUnitParser$ParseResultCallable.invoke(JUnitParser.java:118)
        at hudson.FilePath$FileCallableWrapper.call(FilePath.java:2917)
        at hudson.remoting.UserRequest.perform(UserRequest.java:212)
        at hudson.remoting.UserRequest.perform(UserRequest.java:54)
        at hudson.remoting.Request$2.run(Request.java:369)
        at hudson.remoting.InterceptingExecutorService$1.call(InterceptingExecutorService.java:72)
        at java.util.concurrent.FutureTask.run(FutureTask.java:266)
        at java.util.concurrent.ThreadPoolExecutor.runWorker(ThreadPoolExecutor.java:1149)
        at java.util.concurrent.ThreadPoolExecutor$Worker.run(ThreadPoolExecutor.java:624)
        at java.lang.Thread.run(Thread.java:748)
Build step 'Publish JUnit test result report' marked build as failure

_______________________________________________
Kamailio (SER) - Development Mailing List
[hidden email]
https://lists.kamailio.org/cgi-bin/mailman/listinfo/sr-dev
Reply | Threaded
Open this post in threaded view
|

[sr-dev] Build failed in Jenkins: kamailiodev-nightly-binaries » i386,xenial,slave #1167

jenkins-2
See <https://kamailio.sipwise.com/job/kamailiodev-nightly-binaries/architecture=i386,distribution=xenial,label=slave/1167/display/redirect>

------------------------------------------
[...truncated 1.34 MB...]
dpkg-deb: building package 'kamailio-mysql-modules' in '../kamailio-mysql-modules_5.2.0~dev6+0~20180819005700.1182+xenial_i386.deb'.
dpkg-deb: building package 'kamailio-postgres-modules' in '../kamailio-postgres-modules_5.2.0~dev6+0~20180819005700.1182+xenial_i386.deb'.
dpkg-deb: building package 'kamailio-cpl-modules' in '../kamailio-cpl-modules_5.2.0~dev6+0~20180819005700.1182+xenial_i386.deb'.
dpkg-deb: building package 'kamailio-radius-modules' in '../kamailio-radius-modules_5.2.0~dev6+0~20180819005700.1182+xenial_i386.deb'.
dpkg-deb: building package 'kamailio-unixodbc-modules' in '../kamailio-unixodbc-modules_5.2.0~dev6+0~20180819005700.1182+xenial_i386.deb'.
dpkg-deb: building package 'kamailio-presence-modules' in '../kamailio-presence-modules_5.2.0~dev6+0~20180819005700.1182+xenial_i386.deb'.
dpkg-deb: building package 'kamailio-perl-modules' in '../kamailio-perl-modules_5.2.0~dev6+0~20180819005700.1182+xenial_i386.deb'.
dpkg-deb: building package 'kamailio-snmpstats-modules' in '../kamailio-snmpstats-modules_5.2.0~dev6+0~20180819005700.1182+xenial_i386.deb'.
dpkg-deb: building package 'kamailio-xmpp-modules' in '../kamailio-xmpp-modules_5.2.0~dev6+0~20180819005700.1182+xenial_i386.deb'.
dpkg-deb: building package 'kamailio-xml-modules' in '../kamailio-xml-modules_5.2.0~dev6+0~20180819005700.1182+xenial_i386.deb'.
dpkg-deb: building package 'kamailio-berkeley-modules' in '../kamailio-berkeley-modules_5.2.0~dev6+0~20180819005700.1182+xenial_i386.deb'.
dpkg-deb: building package 'kamailio-berkeley-bin' in '../kamailio-berkeley-bin_5.2.0~dev6+0~20180819005700.1182+xenial_i386.deb'.
dpkg-deb: building package 'kamailio-ldap-modules' in '../kamailio-ldap-modules_5.2.0~dev6+0~20180819005700.1182+xenial_i386.deb'.
dpkg-deb: building package 'kamailio-ims-modules' in '../kamailio-ims-modules_5.2.0~dev6+0~20180819005700.1182+xenial_i386.deb'.
dpkg-deb: building package 'kamailio-utils-modules' in '../kamailio-utils-modules_5.2.0~dev6+0~20180819005700.1182+xenial_i386.deb'.
dpkg-deb: building package 'kamailio-sctp-modules' in '../kamailio-sctp-modules_5.2.0~dev6+0~20180819005700.1182+xenial_i386.deb'.
dpkg-deb: building package 'kamailio-java-modules' in '../kamailio-java-modules_5.2.0~dev6+0~20180819005700.1182+xenial_i386.deb'.
dpkg-deb: building package 'kamailio-tls-modules' in '../kamailio-tls-modules_5.2.0~dev6+0~20180819005700.1182+xenial_i386.deb'.
dpkg-deb: building package 'kamailio-outbound-modules' in '../kamailio-outbound-modules_5.2.0~dev6+0~20180819005700.1182+xenial_i386.deb'.
dpkg-deb: building package 'kamailio-websocket-modules' in '../kamailio-websocket-modules_5.2.0~dev6+0~20180819005700.1182+xenial_i386.deb'.
dpkg-deb: building package 'kamailio-dnssec-modules' in '../kamailio-dnssec-modules_5.2.0~dev6+0~20180819005700.1182+xenial_i386.deb'.
dpkg-deb: building package 'kamailio-autheph-modules' in '../kamailio-autheph-modules_5.2.0~dev6+0~20180819005700.1182+xenial_i386.deb'.
dpkg-deb: building package 'kamailio-kazoo-modules' in '../kamailio-kazoo-modules_5.2.0~dev6+0~20180819005700.1182+xenial_i386.deb'.
dpkg-deb: building package 'kamailio-rabbitmq-modules' in '../kamailio-rabbitmq-modules_5.2.0~dev6+0~20180819005700.1182+xenial_i386.deb'.
dpkg-deb: building package 'kamailio-cnxcc-modules' in '../kamailio-cnxcc-modules_5.2.0~dev6+0~20180819005700.1182+xenial_i386.deb'.
dpkg-deb: building package 'kamailio-erlang-modules' in '../kamailio-erlang-modules_5.2.0~dev6+0~20180819005700.1182+xenial_i386.deb'.
dpkg-deb: building package 'kamailio-systemd-modules' in '../kamailio-systemd-modules_5.2.0~dev6+0~20180819005700.1182+xenial_i386.deb'.
dpkg-deb: building package 'kamailio-phonenum-modules' in '../kamailio-phonenum-modules_5.2.0~dev6+0~20180819005700.1182+xenial_i386.deb'.
dpkg-deb: building package 'kamailio-mongodb-modules' in '../kamailio-mongodb-modules_5.2.0~dev6+0~20180819005700.1182+xenial_i386.deb'.
dpkg-deb: building package 'kamailio-nth' in '../kamailio-nth_5.2.0~dev6+0~20180819005700.1182+xenial_i386.deb'.
dpkg-deb: building package 'kamailio-extra-modules' in '../kamailio-extra-modules_5.2.0~dev6+0~20180819005700.1182+xenial_i386.deb'.
make[1]: Leaving directory '/tmp/buildd/kamailio-5.2.0~dev6+0~20180819005700.1182+xenial'
 dpkg-genchanges -B -B >../kamailio_5.2.0~dev6+0~20180819005700.1182+xenial_i386.changes
dpkg-genchanges: binary-only arch-specific upload (source code and arch-indep packages not included)
 dpkg-source --after-build kamailio-5.2.0~dev6+0~20180819005700.1182+xenial
dpkg-buildpackage: binary-only upload (no source included)
I: user script /var/cache/pbuilder/build/cow.1119/tmp/hooks/B20autopkgtest starting
+ cd /tmp/buildd/kamailio-5.2.0~dev6+0~20180819005700.1182+xenial/debian/..
+ [ ! -f debian/tests/control ]
+ echo Package does not have autopkgtest support, debian/tests/control is missing
Package does not have autopkgtest support, debian/tests/control is missing
+ exit 0
I: user script /var/cache/pbuilder/build/cow.1119/tmp/hooks/B20autopkgtest finished
I: Copying back the cached apt archive contents
I: unmounting /tmp/apt-jdg_4HdaRY filesystem
I: unmounting dev/pts filesystem
I: unmounting run/shm filesystem
I: unmounting proc filesystem
I: Current time: Sun Aug 19 01:49:08 UTC 2018
I: pbuilder-time-stamp: 1534643348
 -> Cleaning COW directory
  forking: rm -rf /var/cache/pbuilder/build//cow.1119
+ '[' 0 -eq 0 ']'
+ rm -f /var/run/lock/xenial-i386.building.923
+ '[' -n true ']'
+ echo '*** Config variable '\''BUILD_ONLY'\'' is set, ignoring request to use local repository. ***'
*** Config variable 'BUILD_ONLY' is set, ignoring request to use local repository. ***
+ binaries_to_workspace
+ echo '*** Moving binaries files to workspace. ***'
*** Moving binaries files to workspace. ***
+ mv <https://kamailio.sipwise.com/job/kamailiodev-nightly-binaries/architecture=i386,distribution=xenial,label=slave/1167/artifact/binaries/kamailio_5.2.0~dev6+0~20180819005700.1182+xenial.dsc> <https://kamailio.sipwise.com/job/kamailiodev-nightly-binaries/architecture=i386,distribution=xenial,label=slave/1167/artifact/binaries/kamailio_5.2.0~dev6+0~20180819005700.1182+xenial_i386.changes> <https://kamailio.sipwise.com/job/kamailiodev-nightly-binaries/architecture=i386,distribution=xenial,label=slave/1167/artifact/binaries/kamailio_5.2.0~dev6+0~20180819005700.1182+xenial_i386.deb> <https://kamailio.sipwise.com/job/kamailiodev-nightly-binaries/architecture=i386,distribution=xenial,label=slave/1167/artifact/binaries/kamailio_5.2.0~dev6+0~20180819005700.1182+xenial.tar.xz> <https://kamailio.sipwise.com/job/kamailiodev-nightly-binaries/architecture=i386,distribution=xenial,label=slave/1167/artifact/binaries/kamailio-autheph-modules_5.2.0~dev6+0~20180819005700.1182+xenial_i386.deb> <https://kamailio.sipwise.com/job/kamailiodev-nightly-binaries/architecture=i386,distribution=xenial,label=slave/1167/artifact/binaries/kamailio-berkeley-bin_5.2.0~dev6+0~20180819005700.1182+xenial_i386.deb> <https://kamailio.sipwise.com/job/kamailiodev-nightly-binaries/architecture=i386,distribution=xenial,label=slave/1167/artifact/binaries/kamailio-berkeley-modules_5.2.0~dev6+0~20180819005700.1182+xenial_i386.deb> <https://kamailio.sipwise.com/job/kamailiodev-nightly-binaries/architecture=i386,distribution=xenial,label=slave/1167/artifact/binaries/kamailio-cnxcc-modules_5.2.0~dev6+0~20180819005700.1182+xenial_i386.deb> <https://kamailio.sipwise.com/job/kamailiodev-nightly-binaries/architecture=i386,distribution=xenial,label=slave/1167/artifact/binaries/kamailio-cpl-modules_5.2.0~dev6+0~20180819005700.1182+xenial_i386.deb> <https://kamailio.sipwise.com/job/kamailiodev-nightly-binaries/architecture=i386,distribution=xenial,label=slave/1167/artifact/binaries/kamailio-dbg_5.2.0~dev6+0~20180819005700.1182+xenial_i386.deb> <https://kamailio.sipwise.com/job/kamailiodev-nightly-binaries/architecture=i386,distribution=xenial,label=slave/1167/artifact/binaries/kamailio-dnssec-modules_5.2.0~dev6+0~20180819005700.1182+xenial_i386.deb> <https://kamailio.sipwise.com/job/kamailiodev-nightly-binaries/architecture=i386,distribution=xenial,label=slave/1167/artifact/binaries/kamailio-erlang-modules_5.2.0~dev6+0~20180819005700.1182+xenial_i386.deb> <https://kamailio.sipwise.com/job/kamailiodev-nightly-binaries/architecture=i386,distribution=xenial,label=slave/1167/artifact/binaries/kamailio-extra-modules_5.2.0~dev6+0~20180819005700.1182+xenial_i386.deb> <https://kamailio.sipwise.com/job/kamailiodev-nightly-binaries/architecture=i386,distribution=xenial,label=slave/1167/artifact/binaries/kamailio-geoip2-modules_5.2.0~dev6+0~20180819005700.1182+xenial_i386.deb> <https://kamailio.sipwise.com/job/kamailiodev-nightly-binaries/architecture=i386,distribution=xenial,label=slave/1167/artifact/binaries/kamailio-geoip-modules_5.2.0~dev6+0~20180819005700.1182+xenial_i386.deb> <https://kamailio.sipwise.com/job/kamailiodev-nightly-binaries/architecture=i386,distribution=xenial,label=slave/1167/artifact/binaries/kamailio-ims-modules_5.2.0~dev6+0~20180819005700.1182+xenial_i386.deb> <https://kamailio.sipwise.com/job/kamailiodev-nightly-binaries/architecture=i386,distribution=xenial,label=slave/1167/artifact/binaries/kamailio-java-modules_5.2.0~dev6+0~20180819005700.1182+xenial_i386.deb> <https://kamailio.sipwise.com/job/kamailiodev-nightly-binaries/architecture=i386,distribution=xenial,label=slave/1167/artifact/binaries/kamailio-json-modules_5.2.0~dev6+0~20180819005700.1182+xenial_i386.deb> <https://kamailio.sipwise.com/job/kamailiodev-nightly-binaries/architecture=i386,distribution=xenial,label=slave/1167/artifact/binaries/kamailio-kazoo-modules_5.2.0~dev6+0~20180819005700.1182+xenial_i386.deb> <https://kamailio.sipwise.com/job/kamailiodev-nightly-binaries/architecture=i386,distribution=xenial,label=slave/1167/artifact/binaries/kamailio-ldap-modules_5.2.0~dev6+0~20180819005700.1182+xenial_i386.deb> <https://kamailio.sipwise.com/job/kamailiodev-nightly-binaries/architecture=i386,distribution=xenial,label=slave/1167/artifact/binaries/kamailio-lua-modules_5.2.0~dev6+0~20180819005700.1182+xenial_i386.deb> <https://kamailio.sipwise.com/job/kamailiodev-nightly-binaries/architecture=i386,distribution=xenial,label=slave/1167/artifact/binaries/kamailio-memcached-modules_5.2.0~dev6+0~20180819005700.1182+xenial_i386.deb> <https://kamailio.sipwise.com/job/kamailiodev-nightly-binaries/architecture=i386,distribution=xenial,label=slave/1167/artifact/binaries/kamailio-mongodb-modules_5.2.0~dev6+0~20180819005700.1182+xenial_i386.deb> <https://kamailio.sipwise.com/job/kamailiodev-nightly-binaries/architecture=i386,distribution=xenial,label=slave/1167/artifact/binaries/kamailio-mono-modules_5.2.0~dev6+0~20180819005700.1182+xenial_i386.deb> <https://kamailio.sipwise.com/job/kamailiodev-nightly-binaries/architecture=i386,distribution=xenial,label=slave/1167/artifact/binaries/kamailio-mysql-modules_5.2.0~dev6+0~20180819005700.1182+xenial_i386.deb> <https://kamailio.sipwise.com/job/kamailiodev-nightly-binaries/architecture=i386,distribution=xenial,label=slave/1167/artifact/binaries/kamailio-nth_5.2.0~dev6+0~20180819005700.1182+xenial_i386.deb> <https://kamailio.sipwise.com/job/kamailiodev-nightly-binaries/architecture=i386,distribution=xenial,label=slave/1167/artifact/binaries/kamailio-outbound-modules_5.2.0~dev6+0~20180819005700.1182+xenial_i386.deb> <https://kamailio.sipwise.com/job/kamailiodev-nightly-binaries/architecture=i386,distribution=xenial,label=slave/1167/artifact/binaries/kamailio-perl-modules_5.2.0~dev6+0~20180819005700.1182+xenial_i386.deb> <https://kamailio.sipwise.com/job/kamailiodev-nightly-binaries/architecture=i386,distribution=xenial,label=slave/1167/artifact/binaries/kamailio-phonenum-modules_5.2.0~dev6+0~20180819005700.1182+xenial_i386.deb> <https://kamailio.sipwise.com/job/kamailiodev-nightly-binaries/architecture=i386,distribution=xenial,label=slave/1167/artifact/binaries/kamailio-postgres-modules_5.2.0~dev6+0~20180819005700.1182+xenial_i386.deb> <https://kamailio.sipwise.com/job/kamailiodev-nightly-binaries/architecture=i386,distribution=xenial,label=slave/1167/artifact/binaries/kamailio-presence-modules_5.2.0~dev6+0~20180819005700.1182+xenial_i386.deb> <https://kamailio.sipwise.com/job/kamailiodev-nightly-binaries/architecture=i386,distribution=xenial,label=slave/1167/artifact/binaries/kamailio-python-modules_5.2.0~dev6+0~20180819005700.1182+xenial_i386.deb> <https://kamailio.sipwise.com/job/kamailiodev-nightly-binaries/architecture=i386,distribution=xenial,label=slave/1167/artifact/binaries/kamailio-rabbitmq-modules_5.2.0~dev6+0~20180819005700.1182+xenial_i386.deb> <https://kamailio.sipwise.com/job/kamailiodev-nightly-binaries/architecture=i386,distribution=xenial,label=slave/1167/artifact/binaries/kamailio-radius-modules_5.2.0~dev6+0~20180819005700.1182+xenial_i386.deb> <https://kamailio.sipwise.com/job/kamailiodev-nightly-binaries/architecture=i386,distribution=xenial,label=slave/1167/artifact/binaries/kamailio-redis-modules_5.2.0~dev6+0~20180819005700.1182+xenial_i386.deb> <https://kamailio.sipwise.com/job/kamailiodev-nightly-binaries/architecture=i386,distribution=xenial,label=slave/1167/artifact/binaries/kamailio-sctp-modules_5.2.0~dev6+0~20180819005700.1182+xenial_i386.deb> <https://kamailio.sipwise.com/job/kamailiodev-nightly-binaries/architecture=i386,distribution=xenial,label=slave/1167/artifact/binaries/kamailio-snmpstats-modules_5.2.0~dev6+0~20180819005700.1182+xenial_i386.deb> <https://kamailio.sipwise.com/job/kamailiodev-nightly-binaries/architecture=i386,distribution=xenial,label=slave/1167/artifact/binaries/kamailio-sqlite-modules_5.2.0~dev6+0~20180819005700.1182+xenial_i386.deb> <https://kamailio.sipwise.com/job/kamailiodev-nightly-binaries/architecture=i386,distribution=xenial,label=slave/1167/artifact/binaries/kamailio-systemd-modules_5.2.0~dev6+0~20180819005700.1182+xenial_i386.deb> <https://kamailio.sipwise.com/job/kamailiodev-nightly-binaries/architecture=i386,distribution=xenial,label=slave/1167/artifact/binaries/kamailio-tls-modules_5.2.0~dev6+0~20180819005700.1182+xenial_i386.deb> <https://kamailio.sipwise.com/job/kamailiodev-nightly-binaries/architecture=i386,distribution=xenial,label=slave/1167/artifact/binaries/kamailio-unixodbc-modules_5.2.0~dev6+0~20180819005700.1182+xenial_i386.deb> <https://kamailio.sipwise.com/job/kamailiodev-nightly-binaries/architecture=i386,distribution=xenial,label=slave/1167/artifact/binaries/kamailio-utils-modules_5.2.0~dev6+0~20180819005700.1182+xenial_i386.deb> <https://kamailio.sipwise.com/job/kamailiodev-nightly-binaries/architecture=i386,distribution=xenial,label=slave/1167/artifact/binaries/kamailio-websocket-modules_5.2.0~dev6+0~20180819005700.1182+xenial_i386.deb> <https://kamailio.sipwise.com/job/kamailiodev-nightly-binaries/architecture=i386,distribution=xenial,label=slave/1167/artifact/binaries/kamailio-xml-modules_5.2.0~dev6+0~20180819005700.1182+xenial_i386.deb> <https://kamailio.sipwise.com/job/kamailiodev-nightly-binaries/architecture=i386,distribution=xenial,label=slave/1167/artifact/binaries/kamailio-xmpp-modules_5.2.0~dev6+0~20180819005700.1182+xenial_i386.deb> <https://kamailio.sipwise.com/job/kamailiodev-nightly-binaries/architecture=i386,distribution=xenial,label=slave/ws/>
+ rmdir <https://kamailio.sipwise.com/job/kamailiodev-nightly-binaries/architecture=i386,distribution=xenial,label=slave/ws/binaries/>
+ autopkg_run
+ case "${ADT:-}" in
+ echo '*** Skipping external autopkgtests as ADT is neither set to '\''external'\'' nor '\''all'\'' ***'
*** Skipping external autopkgtests as ADT is neither set to 'external' nor 'all' ***
+ return 0
+ autopkgtest_results
+ '[' -n '' ']'
+ mkdir -p adt
+ '[' -r autopkgtest.summary ']'
+ touch adt/summary
+ '[' -n /home/admin/kamailio-deb-jenkins/scripts/jdg-debc ']'
+ echo '*** Found environment variable POST_BUILD_HOOK, set to /home/admin/kamailio-deb-jenkins/scripts/jdg-debc ***'
*** Found environment variable POST_BUILD_HOOK, set to /home/admin/kamailio-deb-jenkins/scripts/jdg-debc ***
+ sh /home/admin/kamailio-deb-jenkins/scripts/jdg-debc
  ┌──────────────────────────────────────────────────────────────────────────────┐
  │  Displaying content of generated Debian packages.                            │
  └──────────────────────────────────────────────────────────────────────────────┘
debc: no appropriate .debs found in the changes file kamailio_5.2.0~dev6+0~20180819005700.1182+xenial_i386.changes!
+ bailout 0
+ '[' -n 0 ']'
+ EXIT=0
+ '[' -n '' ']'
+ rm -f /var/run/lock/xenial-i386.building.923
+ '[' -r /var/run/lock/xenial-i386.update.923 ']'
+ '[' '' = true ']'
+ echo '*** Getting rid of files in <https://kamailio.sipwise.com/job/kamailiodev-nightly-binaries/architecture=i386,distribution=xenial,label=slave/ws/binaries/> to avoid problems in next run. ***'
*** Getting rid of files in <https://kamailio.sipwise.com/job/kamailiodev-nightly-binaries/architecture=i386,distribution=xenial,label=slave/ws/binaries/> to avoid problems in next run. ***
+ rm -f '<https://kamailio.sipwise.com/job/kamailiodev-nightly-binaries/architecture=i386,distribution=xenial,label=slave/ws/binaries/*'>
+ '[' -n /tmp/tmp.foJ78kjhNW ']'
+ rm -rf /tmp/tmp.foJ78kjhNW
+ '[' -n /tmp/apt-jdg_4HdaRY ']'
+ sudo rm -rf /tmp/apt-jdg_4HdaRY
+ '[' -n 2280 ']'
++ sed -e 's/^\([0-9]*\).*/\1/'
+ SECONDS=723
++ date
+ echo '*** Finished execution of /usr/bin/build-and-provide-package at Sun Aug 19 01:49:09 UTC 2018 [running 723 seconds] ***'
*** Finished execution of /usr/bin/build-and-provide-package at Sun Aug 19 01:49:09 UTC 2018 [running 723 seconds] ***
+ exit 0
[slave] $ /bin/sh -xe /tmp/jenkins4481892115836889347.sh
+ mkdir -p report
+ /usr/bin/lintian-junit-report kamailio_5.2.0~dev6+0~20180819005700.1182+xenial_i386.changes kamailio_5.2.0~dev6+0~20180819005731.1182+xenial_source.changes
<https://kamailio.sipwise.com/job/kamailiodev-nightly-binaries/architecture=i386,distribution=xenial,label=slave/1167/artifact/kamailio_5.2.0~dev6+0~20180819005731.1182+xenial_source.buildinfo> does not exist, exiting
[slave] $ /bin/sh -xe /tmp/jenkins684151138927371516.sh
+ mkdir -p report adt
+ touch adt/summary
+ /usr/bin/adtsummary_tap adt/summary
Archiving artifacts
ERROR: Step ‘Archive the artifacts’ aborted due to exception:
java.nio.file.NoSuchFileException: <https://kamailio.sipwise.com/job/kamailiodev-nightly-binaries/architecture=i386,distribution=xenial,label=slave/1167/artifact/kamailio-dnssec-modules_5.2.0~dev6+0~20180819005700.1182+xenial_i386.deb>
        at sun.nio.fs.UnixException.translateToIOException(UnixException.java:86)
        at sun.nio.fs.UnixException.rethrowAsIOException(UnixException.java:102)
        at sun.nio.fs.UnixException.rethrowAsIOException(UnixException.java:107)
        at sun.nio.fs.UnixFileAttributeViews$Posix.readAttributes(UnixFileAttributeViews.java:218)
        at sun.nio.fs.UnixFileAttributeViews$Posix.readAttributes(UnixFileAttributeViews.java:131)
        at sun.nio.fs.UnixFileSystemProvider.readAttributes(UnixFileSystemProvider.java:144)
        at sun.nio.fs.LinuxFileSystemProvider.readAttributes(LinuxFileSystemProvider.java:99)
        at java.nio.file.Files.readAttributes(Files.java:1737)
        at java.nio.file.Files.getPosixFilePermissions(Files.java:2004)
        at hudson.util.IOUtils.mode(IOUtils.java:130)
Also:   hudson.remoting.Channel$CallSiteStackTrace: Remote call to jenkins-debian-glue-slave (i-053f4789d09b4dd78)
                at hudson.remoting.Channel.attachCallSiteStackTrace(Channel.java:1741)
                at hudson.remoting.UserRequest$ExceptionResponse.retrieve(UserRequest.java:357)
                at hudson.remoting.Channel$2.adapt(Channel.java:990)
                at hudson.remoting.Channel$2.adapt(Channel.java:986)
                at hudson.remoting.FutureAdapter.get(FutureAdapter.java:55)
                at hudson.FilePath.copyRecursiveTo(FilePath.java:2375)
                at jenkins.model.StandardArtifactManager.archive(StandardArtifactManager.java:61)
                at hudson.tasks.ArtifactArchiver.perform(ArtifactArchiver.java:235)
                at hudson.tasks.BuildStepCompatibilityLayer.perform(BuildStepCompatibilityLayer.java:81)
                at hudson.tasks.BuildStepMonitor$1.perform(BuildStepMonitor.java:20)
                at hudson.model.AbstractBuild$AbstractBuildExecution.perform(AbstractBuild.java:744)
                at hudson.model.AbstractBuild$AbstractBuildExecution.performAllBuildSteps(AbstractBuild.java:690)
                at hudson.model.Build$BuildExecution.post2(Build.java:186)
                at hudson.model.AbstractBuild$AbstractBuildExecution.post(AbstractBuild.java:635)
                at hudson.model.Run.execute(Run.java:1823)
                at hudson.matrix.MatrixRun.run(MatrixRun.java:153)
                at hudson.model.ResourceController.execute(ResourceController.java:97)
                at hudson.model.Executor.run(Executor.java:429)
Caused: hudson.os.PosixException: Unable to get file permissions null
        at hudson.util.IOUtils.mode(IOUtils.java:133)
        at hudson.util.io.TarArchiver.visit(TarArchiver.java:92)
        at hudson.util.DirScanner.scanSingle(DirScanner.java:44)
        at hudson.FilePath$ExplicitlySpecifiedDirScanner.scan(FilePath.java:2995)
        at hudson.FilePath.writeToTar(FilePath.java:2432)
        at hudson.FilePath.access$2800(FilePath.java:210)
        at hudson.FilePath$CopyRecursiveRemoteToLocal.invoke(FilePath.java:2397)
        at hudson.FilePath$CopyRecursiveRemoteToLocal.invoke(FilePath.java:2386)
        at hudson.FilePath$FileCallableWrapper.call(FilePath.java:2917)
        at hudson.remoting.UserRequest.perform(UserRequest.java:212)
        at hudson.remoting.UserRequest.perform(UserRequest.java:54)
        at hudson.remoting.Request$2.run(Request.java:369)
        at hudson.remoting.InterceptingExecutorService$1.call(InterceptingExecutorService.java:72)
        at java.util.concurrent.FutureTask.run(FutureTask.java:266)
        at java.util.concurrent.ThreadPoolExecutor.runWorker(ThreadPoolExecutor.java:1149)
        at java.util.concurrent.ThreadPoolExecutor$Worker.run(ThreadPoolExecutor.java:624)
        at java.lang.Thread.run(Thread.java:748)
Caused: java.io.IOException
        at hudson.FilePath.copyRecursiveTo(FilePath.java:2379)
        at jenkins.model.StandardArtifactManager.archive(StandardArtifactManager.java:61)
        at hudson.tasks.ArtifactArchiver.perform(ArtifactArchiver.java:235)
        at hudson.tasks.BuildStepCompatibilityLayer.perform(BuildStepCompatibilityLayer.java:81)
        at hudson.tasks.BuildStepMonitor$1.perform(BuildStepMonitor.java:20)
        at hudson.model.AbstractBuild$AbstractBuildExecution.perform(AbstractBuild.java:744)
        at hudson.model.AbstractBuild$AbstractBuildExecution.performAllBuildSteps(AbstractBuild.java:690)
        at hudson.model.Build$BuildExecution.post2(Build.java:186)
        at hudson.model.AbstractBuild$AbstractBuildExecution.post(AbstractBuild.java:635)
        at hudson.model.Run.execute(Run.java:1823)
        at hudson.matrix.MatrixRun.run(MatrixRun.java:153)
        at hudson.model.ResourceController.execute(ResourceController.java:97)
        at hudson.model.Executor.run(Executor.java:429)
TAP Reports Processing: START
Looking for TAP results report in workspace using pattern: report/*.tap
ERROR: Step ‘Publish TAP Results’ aborted due to exception:
Also:   hudson.remoting.Channel$CallSiteStackTrace: Remote call to jenkins-debian-glue-slave (i-053f4789d09b4dd78)
                at hudson.remoting.Channel.attachCallSiteStackTrace(Channel.java:1741)
                at hudson.remoting.UserRequest$ExceptionResponse.retrieve(UserRequest.java:357)
                at hudson.remoting.Channel.call(Channel.java:955)
                at hudson.FilePath.act(FilePath.java:1036)
                at hudson.FilePath.act(FilePath.java:1025)
                at hudson.FilePath.list(FilePath.java:1840)
                at hudson.FilePath.list(FilePath.java:1824)
                at hudson.FilePath.list(FilePath.java:1809)
                at org.tap4j.plugin.TapPublisher.locateReports(TapPublisher.java:647)
                at org.tap4j.plugin.TapPublisher.performImpl(TapPublisher.java:383)
                at org.tap4j.plugin.TapPublisher.perform(TapPublisher.java:371)
                at hudson.tasks.BuildStepCompatibilityLayer.perform(BuildStepCompatibilityLayer.java:81)
                at hudson.tasks.BuildStepMonitor$1.perform(BuildStepMonitor.java:20)
                at hudson.model.AbstractBuild$AbstractBuildExecution.perform(AbstractBuild.java:744)
                at hudson.model.AbstractBuild$AbstractBuildExecution.performAllBuildSteps(AbstractBuild.java:690)
                at hudson.model.Build$BuildExecution.post2(Build.java:186)
                at hudson.model.AbstractBuild$AbstractBuildExecution.post(AbstractBuild.java:635)
                at hudson.model.Run.execute(Run.java:1823)
                at hudson.matrix.MatrixRun.run(MatrixRun.java:153)
                at hudson.model.ResourceController.execute(ResourceController.java:97)
                at hudson.model.Executor.run(Executor.java:429)
java.io.IOException: <https://kamailio.sipwise.com/job/kamailiodev-nightly-binaries/architecture=i386,distribution=xenial,label=slave/ws/> does not exist.
        at hudson.FilePath.glob(FilePath.java:1870)
        at hudson.FilePath.access$2400(FilePath.java:210)
        at hudson.FilePath$23.invoke(FilePath.java:1843)
        at hudson.FilePath$23.invoke(FilePath.java:1840)
        at hudson.FilePath$FileCallableWrapper.call(FilePath.java:2917)
        at hudson.remoting.UserRequest.perform(UserRequest.java:212)
        at hudson.remoting.UserRequest.perform(UserRequest.java:54)
        at hudson.remoting.Request$2.run(Request.java:369)
        at hudson.remoting.InterceptingExecutorService$1.call(InterceptingExecutorService.java:72)
        at java.util.concurrent.FutureTask.run(FutureTask.java:266)
        at java.util.concurrent.ThreadPoolExecutor.runWorker(ThreadPoolExecutor.java:1149)
        at java.util.concurrent.ThreadPoolExecutor$Worker.run(ThreadPoolExecutor.java:624)
        at java.lang.Thread.run(Thread.java:748)
Recording test results
ERROR: Build step failed with exception
Also:   hudson.remoting.Channel$CallSiteStackTrace: Remote call to jenkins-debian-glue-slave (i-053f4789d09b4dd78)
                at hudson.remoting.Channel.attachCallSiteStackTrace(Channel.java:1741)
                at hudson.remoting.UserRequest$ExceptionResponse.retrieve(UserRequest.java:357)
                at hudson.remoting.Channel.call(Channel.java:955)
                at hudson.FilePath.act(FilePath.java:1036)
                at hudson.FilePath.act(FilePath.java:1025)
                at hudson.tasks.junit.JUnitParser.parseResult(JUnitParser.java:114)
                at hudson.tasks.junit.JUnitResultArchiver.parse(JUnitResultArchiver.java:136)
                at hudson.tasks.junit.JUnitResultArchiver.parseAndAttach(JUnitResultArchiver.java:166)
                at hudson.tasks.junit.JUnitResultArchiver.perform(JUnitResultArchiver.java:153)
                at hudson.tasks.BuildStepCompatibilityLayer.perform(BuildStepCompatibilityLayer.java:81)
                at hudson.tasks.BuildStepMonitor$1.perform(BuildStepMonitor.java:20)
                at hudson.model.AbstractBuild$AbstractBuildExecution.perform(AbstractBuild.java:744)
                at hudson.model.AbstractBuild$AbstractBuildExecution.performAllBuildSteps(AbstractBuild.java:690)
                at hudson.model.Build$BuildExecution.post2(Build.java:186)
                at hudson.model.AbstractBuild$AbstractBuildExecution.post(AbstractBuild.java:635)
                at hudson.model.Run.execute(Run.java:1823)
                at hudson.matrix.MatrixRun.run(MatrixRun.java:153)
                at hudson.model.ResourceController.execute(ResourceController.java:97)
                at hudson.model.Executor.run(Executor.java:429)
<https://kamailio.sipwise.com/job/kamailiodev-nightly-binaries/architecture=i386,distribution=xenial,label=slave/ws/> does not exist.
        at org.apache.tools.ant.types.AbstractFileSet.getDirectoryScanner(AbstractFileSet.java:484)
        at org.apache.tools.ant.types.AbstractFileSet.getDirectoryScanner(AbstractFileSet.java:461)
        at hudson.tasks.junit.JUnitParser$ParseResultCallable.invoke(JUnitParser.java:141)
        at hudson.tasks.junit.JUnitParser$ParseResultCallable.invoke(JUnitParser.java:118)
        at hudson.FilePath$FileCallableWrapper.call(FilePath.java:2917)
        at hudson.remoting.UserRequest.perform(UserRequest.java:212)
        at hudson.remoting.UserRequest.perform(UserRequest.java:54)
        at hudson.remoting.Request$2.run(Request.java:369)
        at hudson.remoting.InterceptingExecutorService$1.call(InterceptingExecutorService.java:72)
        at java.util.concurrent.FutureTask.run(FutureTask.java:266)
        at java.util.concurrent.ThreadPoolExecutor.runWorker(ThreadPoolExecutor.java:1149)
        at java.util.concurrent.ThreadPoolExecutor$Worker.run(ThreadPoolExecutor.java:624)
        at java.lang.Thread.run(Thread.java:748)
Build step 'Publish JUnit test result report' marked build as failure

_______________________________________________
Kamailio (SER) - Development Mailing List
[hidden email]
https://lists.kamailio.org/cgi-bin/mailman/listinfo/sr-dev
Reply | Threaded
Open this post in threaded view
|

[sr-dev] Jenkins build is back to normal : kamailiodev-nightly-binaries » i386,xenial,slave #1168

jenkins-2